{"text_format":"1","workbook":"xlsx","n_sheets":31,"sheets":["Index","Residuals","T1","T2","T3 & Fig 4","T4","T5 & Fig 7","T6","T7","T8 & Fig 4","T9","T10","T10 A-Z","T12","T11","T13","T14","T15","T16","T17","T18","T19","T20","T21","T22","T23","T24","T25","T26-29","T30","T31"],"not_rendered":{"charts":7,"images":0,"macros":1,"external_links":4,"defined_names":840,"comments":0,"pivot_tables":0},"unopened":[],"bounds":{"document_bytes":16777216,"sheet_cells":100000,"rows_first":2000,"rows_last":500,"rows_between":2000,"halvings":0,"cell_chars":16384,"cell_head_chars":4096},"cells_cut":0,"cells_raw":0,"read":"whole","date_system":"1900"}

{"sheet":"Index","index":0,"n_rows":30,"n_cols":1,"rows_kept":30,"cut":false,"hidden":false,"merged":[]}
["INDEX"]
[{"$f":"Residuals!A1","v":"Residuals and Averages"}]
[{"$f":"'T1'!A1","v":"Table 1 - Summary of Demand Tariffs"}]
[{"$f":"'T2'!A1","v":"Table 2 - Demand Tariffs"}]
[{"$f":"'T3 & Fig 4'!A1","v":"Table 3 - Change in HH Demand Tariffs"}]
[{"$f":"'T4'!A1","v":"Table 4 - Embedded Export Tariff"}]
{"$rows_left_out":25}
{"sheet":"Residuals","index":1,"n_rows":11,"n_cols":5,"rows_kept":11,"cut":false,"hidden":false,"merged":[]}
["Residuals and Averages",null,null,"Return to Index"]
[]
["Residual",{"$f":"'T6'!B3","v":"2020/21 July"},{"$f":"'T6'!C3","v":"2020/21 Draft"},{"$f":"'T6'!D3","v":"Change since last forecast"}]
["Generation",{"$f":"'T6'!B4","v":-4.5335001314730201},{"$f":"'T6'!C4","v":-4.7769008965109583},{"$f":"'T6'!D4","v":-0.24340076503793817}]
["Demand",{"$f":"'T1'!C5","v":52.178588060020509},{"$f":"'T1'!D5","v":51.881473},{"$f":"'T1'!E5","v":-0.29711506002050925}]
[]
{"$rows_left_out":6}
{"sheet":"T1","index":2,"n_rows":13,"n_cols":5,"rows_kept":13,"cut":false,"hidden":false,"merged":[]}
["Table 1 - Summary of Demand Tariffs",null,null,null,"Return to Index"]
[]
[null,"HH Tariffs",{"$f":"'T6'!B3","v":"2020/21 July"},{"$f":"'T6'!C3","v":"2020/21 Draft"},"Change"]
[null,"Average Tariff (£/kW)",51.113948583129542,50.413547000000001,-0.70040158312954048]
[null,"Residual (£/kW)",52.178588060020509,51.881473,-0.29711506002050925]
[null,"EET",{"$f":"C3","v":"2020/21 July"},{"$f":"D3","v":"2020/21 Draft"},"Change"]
{"$rows_left_out":8}
{"sheet":"T2","index":3,"n_rows":20,"n_cols":5,"rows_kept":20,"cut":false,"hidden":false,"merged":[]}
["Table 2 - Demand Tariffs",null,null,null,"Return to Index"]
[]
["Zone","Zone Name","HH Demand Tariff (£/kW)","NHH Demand Tariff (p/kWh)","Embedded Export Tariff (£/kW)"]
[1,"Northern Scotland",22.039463000000001,2.9580739999999999,0]
[2,"Southern Scotland",29.676414999999999,3.8063189999999998,0]
[3,"Northern",40.943295999999997,5.1494099999999996,0]
{"$rows_left_out":15}
{"sheet":"T3 & Fig 4","index":4,"n_rows":34,"n_cols":6,"rows_kept":34,"cut":false,"hidden":false,"merged":[]}
["Table 3 - Change in HH Demand Tariffs",null,null,null,null,"Return to Index"]
[]
["Zone","Zone Name",{"$f":"CONCATENATE('T6'!B3, \" (£/kW)\")","v":"2020/21 July (£/kW)"},{"$f":"CONCATENATE('T6'!C3, \" (£/kW)\")","v":"2020/21 Draft (£/kW)"},"Change (£/kW)","Change in Residual (£/kW)"]
[1,"Northern Scotland",24.098098,22.039463000000001,{"$f":"D4-C4","v":-2.0586349999999989},-0.65213354635746157]
[2,"Southern Scotland",32.442287999999998,29.676414999999999,{"$f":"D5-C5","v":-2.7658729999999991},-0.65213354635746157]
[3,"Northern",42.615678000000003,40.943295999999997,-1.672382000000006,-0.65213354635746157]
{"$rows_left_out":29}
{"sheet":"T4","index":5,"n_rows":34,"n_cols":6,"rows_kept":34,"cut":false,"hidden":false,"merged":[]}
["Table 4 - Embedded Export Tariff",null,null,null,"Return to Index"]
[]
[]
["Zone","Zone Name",{"$f":"'T3 & Fig 4'!C3","v":"2020/21 July (£/kW)"},{"$f":"'T3 & Fig 4'!D3","v":"2020/21 Draft (£/kW)"},"Change (£/kW)"]
[1,"Northern Scotland",0,0,{"$f":"D5-C5","v":0}]
[2,"Southern Scotland",0,0,{"$f":"D6-C6","v":0}]
{"$rows_left_out":29}
{"sheet":"T5 & Fig 7","index":6,"n_rows":17,"n_cols":18,"rows_kept":17,"cut":false,"hidden":false,"merged":[]}
["Table 5 - NHH Demand Tariff Changes",null,null,"Return to Index"]
[]
["Zone","Zone Name",{"$f":"CONCATENATE('T6'!B3,\" (p/kWh)\")","v":"2020/21 July (p/kWh)"},{"$f":"CONCATENATE('T6'!C3,\" (p/kWh)\")","v":"2020/21 Draft (p/kWh)"},"Change (p/kWh)"]
[1,"Northern Scotland",3.2562289999999998,2.9580739999999999,{"$f":"D4-C4","v":-0.29815499999999995}]
[2,"Southern Scotland",4.1639239999999997,3.8063189999999998,{"$f":"D5-C5","v":-0.35760499999999995}]
[3,"Northern",5.3066940000000002,5.1494099999999996,-0.15728400000000065]
{"$rows_left_out":12}
{"sheet":"T6","index":7,"n_rows":5,"n_cols":6,"rows_kept":5,"cut":false,"hidden":false,"merged":[]}
["Table 6 - Changes to Average Tariffs",null,null,null,null,"Return to Index"]
[]
["Generation Tariffs (£/kW)","2020/21 July","2020/21 Draft","Change since last forecast"]
["Residual",-4.5335001314730201,-4.7769008965109583,{"$f":"C4-B4","v":-0.24340076503793817}]
["Average Generation Tariff",5.2210009568422162,4.9285371697507356,{"$f":"C5-B5","v":-0.29246378709148058},"N.B. These generation average tariffs include local tariffs"]

{"sheet":"T7","index":8,"n_rows":33,"n_cols":9,"rows_kept":33,"cut":false,"hidden":false,"merged":[[32,6,32,7],[1,6,1,8],[32,2,32,4]]}
["Table 7 - Generation Wider Tariffs",null,null,null,null,null,null,null,"Return to Index"]
[null,null,null,null,null,null,"Example tariffs for a generator of each technology type"]
[null,null,"System Peak","Shared \nYear Round","Not Shared Year Round","Residual","Conventional Carbon 80%","Conventional Low Carbon 80%","Intermittent 40%"]
["Zone","Zone Name","Tariff\n(£/kW)","Tariff\n(£/kW)","Tariff\n(£/kW)","Tariff\n(£/kW)","Tariff\n(£/kW)","Tariff\n(£/kW)","Tariff\n(£/kW)"]
[1,"North Scotland",2.7575590000000001,20.886178999999998,15.020708000000001,-4.7769009999999996,26.706167600000001,29.710309200000001,18.598278600000004]
[2,"East Aberdeenshire",4.9350379999999996,13.275963000000001,15.020708000000001,-4.7769009999999996,22.795473800000003,25.799615400000004,15.554192200000003]
{"$rows_left_out":28}
{"sheet":"T8 & Fig 4","index":9,"n_rows":35,"n_cols":12,"rows_kept":35,"cut":false,"hidden":false,"merged":[[3,0,3,11],[4,2,4,4],[4,8,4,10],[4,11,5,11],[0,0,0,10],[4,5,4,7]]}
["Table 8 - Generation Tariff Changes",null,null,null,null,null,null,null,null,null,null,"Return to Index"]
[]
[]
["Wider Generation Tariffs (£/kW)"]
[null,null,"Conventional Carbon 80%",null,null,"Conventional Low Carbon 80%",null,null,"Intermittent 40%",null,null,"Change in Residual (£/kW)"]
["Zone","Zone Name",{"$f":"'T4'!C4","v":"2020/21 July (£/kW)"},{"$f":"'T4'!D4","v":"2020/21 Draft (£/kW)"},"Change (£/kW)",{"$f":"C6","v":"2020/21 July (£/kW)"},{"$f":"D6","v":"2020/21 Draft (£/kW)"},"Change (£/kW)",{"$f":"F6","v":"2020/21 July (£/kW)"},{"$f":"G6","v":"2020/21 Draft (£/kW)"},"Change (£/kW)"]
{"$rows_left_out":30}
{"sheet":"T9","index":10,"n_rows":9,"n_cols":5,"rows_kept":9,"cut":false,"hidden":false,"merged":[[3,0,4,0],[3,1,4,1],[2,0,2,4],[3,2,4,2],[3,3,4,3],[3,4,4,4]]}
["Table 9 - Local Substation Tariffs",null,null,null,"Return to Index"]
[]
["2020/21 Local Substation Tariff (£/kW)"]
["Substation\nRating","Connection\nType","132kV","275kV","400kV"]
[]
["<1320 MW","No redundancy",0.20327300000000001,0.116285,8.3785999999999999E-2]
{"$rows_left_out":4}
{"sheet":"T10","index":11,"n_rows":29,"n_cols":8,"rows_kept":29,"cut":false,"hidden":false,"merged":[[0,0,0,5]]}
["Table 10 - Onshore Local Circuit Tariffs",null,null,null,null,null,null,"Return to Index"]
[]
["Substation Name","(£/kW)","Substation Name","(£/kW)","Substation Name","(£/kW)"]
["Achruach",4.3470870692634183,"Farr",3.6097814001432824,"Nant",-1.2438788077756828]
["Aigas",0.66216577922577813,"Fallago",0.43890298621434759,"Necton",1.1374560389314685]
["An Suidhe",-0.96988197600885051,"Fernoch",4.4534480895645014,"Rhigos",0.10289327328954377]
{"$rows_left_out":24}
{"sheet":"T10 A-Z","index":12,"n_rows":29,"n_cols":8,"rows_kept":29,"cut":false,"hidden":false,"merged":[[0,0,0,5]]}
["Table 10 - Onshore Local Circuit Tariffs",null,null,null,null,null,null,"Return to Index"]
[]
["Substation Name","(£/kW)","Substation Name","(£/kW)","Substation Name","(£/kW)"]
["Aberarder",{"$f":"IF(ISNA(VLOOKUP(A4,'T10'!$A$4:$B$29,2,0)),IF(ISNA(VLOOKUP(A4,'T10'!$C$4:$D$29,2,0)),VLOOKUP(A4,'T10'!$E$4:$F$29,2,0),VLOOKUP(A4,'T10'!$C$4:$D$29,2,0)),VLOOKUP(A4,'T10'!$A$4:$B$29,2,0))","v":1.6755695375516726},"Dunhill",{"$f":"IF(ISNA(VLOOKUP(C4,'T10'!$A$4:$B$29,2,0)),IF(ISNA(VLOOKUP(C4,'T10'!$C$4:$D$29,2,0)),VLOOKUP(C4,'T10'!$E$4:$F$29,2,0),VLOOKUP(C4,'T10'!$C$4:$D$29,2,0)),VLOOKUP(C4,'T10'!$A$4:$B$29,2,0))","v":1.450144535897758},"Mark Hill",{"$f":"IF(ISNA(VLOOKUP(E4,'T10'!$A$4:$B$29,2,0)),IF(ISNA(VLOOKUP(E4,'T10'!$C$4:$D$29,2,0)),VLOOKUP(E4,'T10'!$E$4:$F$29,2,0),VLOOKUP(E4,'T10'!$C$4:$D$29,2,0)),VLOOKUP(E4,'T10'!$A$4:$B$29,2,0))","v":0.88646267760546416}]
["Aberdeen Bay",{"$f":"IF(ISNA(VLOOKUP(A5,'T10'!$A$4:$B$29,2,0)),IF(ISNA(VLOOKUP(A5,'T10'!$C$4:$D$29,2,0)),VLOOKUP(A5,'T10'!$E$4:$F$29,2,0),VLOOKUP(A5,'T10'!$C$4:$D$29,2,0)),VLOOKUP(A5,'T10'!$A$4:$B$29,2,0))","v":2.6397859810549789},"Dunlaw Extension",{"$f":"IF(ISNA(VLOOKUP(C5,'T10'!$A$4:$B$29,2,0)),IF(ISNA(VLOOKUP(C5,'T10'!$C$4:$D$29,2,0)),VLOOKUP(C5,'T10'!$E$4:$F$29,2,0),VLOOKUP(C5,'T10'!$C$4:$D$29,2,0)),VLOOKUP(C5,'T10'!$A$4:$B$29,2,0))","v":1.5269072190115081},"Middle Muir",{"$f":"IF(ISNA(VLOOKUP(E5,'T10'!$A$4:$B$29,2,0)),IF(ISNA(VLOOKUP(E5,'T10'!$C$4:$D$29,2,0)),VLOOKUP(E5,'T10'!$E$4:$F$29,2,0),VLOOKUP(E5,'T10'!$C$4:$D$29,2,0)),VLOOKUP(E5,'T10'!$A$4:$B$29,2,0))","v":2.0068548393985219}]
["Achruach",{"$f":"IF(ISNA(VLOOKUP(A6,'T10'!$A$4:$B$29,2,0)),IF(ISNA(VLOOKUP(A6,'T10'!$C$4:$D$29,2,0)),VLOOKUP(A6,'T10'!$E$4:$F$29,2,0),VLOOKUP(A6,'T10'!$C$4:$D$29,2,0)),VLOOKUP(A6,'T10'!$A$4:$B$29,2,0))","v":4.3470870692634183},"Edinbane",{"$f":"IF(ISNA(VLOOKUP(C6,'T10'!$A$4:$B$29,2,0)),IF(ISNA(VLOOKUP(C6,'T10'!$C$4:$D$29,2,0)),VLOOKUP(C6,'T10'!$E$4:$F$29,2,0),VLOOKUP(C6,'T10'!$C$4:$D$29,2,0)),VLOOKUP(C6,'T10'!$A$4:$B$29,2,0))","v":6.9306712641356443},"Middleton",{"$f":"IF(ISNA(VLOOKUP(E6,'T10'!$A$4:$B$29,2,0)),IF(ISNA(VLOOKUP(E6,'T10'!$C$4:$D$29,2,0)),VLOOKUP(E6,'T10'!$E$4:$F$29,2,0),VLOOKUP(E6,'T10'!$C$4:$D$29,2,0)),VLOOKUP(E6,'T10'!$A$4:$B$29,2,0))","v":0.15034401220978391}]
{"$rows_left_out":24}
{"sheet":"T12","index":13,"n_rows":23,"n_cols":4,"rows_kept":23,"cut":false,"hidden":false,"merged":[[2,0,3,0],[2,1,2,3]]}
["Table 12 - Offshore Local Tariffs",null,null,"Return to Index"]
[]
["Offshore Generator","Tariff Component (£/kW)"]
[null,"Substation","Circuit","ETUoS"]
["Barrow",8.1692739999999997,42.741635000000002,1.0613330000000001]
["Burbo Bank",10.580601,20.257999000000002,0]
{"$rows_left_out":18}
{"sheet":"T11","index":14,"n_rows":17,"n_cols":5,"rows_kept":17,"cut":false,"hidden":false,"merged":[]}
["Table 11 - CMP203: Circuits subject to one-off charges",null,null,null,"Return to Index"]
[]
["Node 1","Node 2","Actual Parameters","Amendment in Transport Model","Generator"]
["Dyce 132kV","Aberdeen Bay 132kV","9.5km of Cable","9.5km of OHL","Aberdeen Bay"]
["Crystal Rig 132kV","Wester Dod 132kV","3.9km of Cable","3.9km of OHL","Aikengall II"]
["Wishaw 132kV","Blacklaw 132kV","11.46km of Cable","11.46km of OHL","Blacklaw"]
{"$rows_left_out":12}
{"sheet":"T13","index":15,"n_rows":6,"n_cols":6,"rows_kept":6,"cut":false,"hidden":false,"merged":[[0,0,0,3]]}
["Table 13 - Contracted and Modelled TEC",null,null,null,"Return to Index"]
[]
["Generation (GW)","2019/20 Final Tariffs","2020/21\nMarch","2020/21 July ","2020/21 Draft ","2020/21 Final"]
["Contracted TEC",80.599999999999994,90.8,84.3,84.9]
["Modelled Best View TEC",80.599999999999994,82.6,80.7,84.9]
["Chargeable TEC",73.3,74.099999999999994,71.8,76]
{"$rows_left_out":1}
{"sheet":"T14","index":16,"n_rows":11,"n_cols":7,"rows_kept":11,"cut":false,"hidden":false,"merged":[]}
["Table 14 - Interconnectors",null,null,null,null,null,"Return to Index"]
[]
["Interconnector","Site","Interconnected\nSystem","Generation\nZone","Transport Model (Generation MW) Peak","Transport Model (Generation MW) Year Round","Charging Base (Generation MW)"]
["IFA Interconnector","Sellindge 400kV","France",24,0,2000,0]
["ElecLink","Sellindge 400kV","France",24,0,1000,0]
["BritNed","Grain 400kV","Netherlands",24,0,1200,0]
{"$rows_left_out":6}
{"sheet":"T15","index":17,"n_rows":24,"n_cols":7,"rows_kept":24,"cut":false,"hidden":false,"merged":[[2,0,3,0],[2,2,2,5]]}
["Table 15 - Allowed Revenues",null,null,null,null,null,"Return to Index"]
[]
["£m Nominal","2019/20 TNUoS Revenue","2020/21 TNUoS Revenue"]
[null,"Jan 2019 Final",{"$f":"'T26-29'!D5","v":"March Forecast"},{"$f":"'T26-29'!E5","v":"July Forecast"},{"$f":"'T26-29'!F5","v":"Nov Draft"},{"$f":"'T26-29'!G5","v":"Jan Final"}]
["National Grid Electricity Transmission"]
["Price controlled revenue",1728.4504300805447,1782.3887580335536,{"$f":"'T26-29'!E23","v":1777.6878000192089},{"$f":"'T26-29'!F23","v":1705.2631045928731}]
{"$rows_left_out":19}
{"sheet":"T16","index":18,"n_rows":12,"n_cols":6,"rows_kept":12,"cut":false,"hidden":false,"merged":[[0,0,0,4]]}
["Table 16 - Generation and Demand Revenue Proportions",null,null,null,null,"Return to Index"]
[]
[null,null,{"$f":"'T13'!C3","v":"2020/21\nMarch"},{"$f":"'T13'!D3","v":"2020/21 July "},{"$f":"'T13'!E3","v":"2020/21 Draft "},{"$f":"'T13'!F3","v":"2020/21 Final"}]
["CAPEC","Limit on generation tariff (€/MWh)",2.5,2.5,{"$f":"D4","v":2.5}]
["y","Error Margin",0.15999999999999998,{"$f":"C5","v":0.15999999999999998},{"$f":"D5","v":0.15999999999999998}]
["ER","Exchange Rate (€/£)",1.1192171907836179,{"$f":"C6","v":1.1192171907836179},{"$f":"D6","v":1.1192171907836179}]
{"$rows_left_out":7}
{"sheet":"T17","index":19,"n_rows":12,"n_cols":5,"rows_kept":12,"cut":false,"hidden":false,"merged":[]}
["Table 17 - Charging Bases",null,null,null,"Return to Index"]
[]
["Charging Bases",{"$f":"'T13'!C3","v":"2020/21\nMarch"},{"$f":"'T13'!D3","v":"2020/21 July "},{"$f":"'T13'!E3","v":"2020/21 Draft "},{"$f":"'T13'!F3","v":"2020/21 Final"}]
["Generation (GW)",74.110039999999998,71.811189999999982,76.07253]
["NHH Demand (4pm-7pm TWh)",24.125076702721522,24.310000000000002,25.126417524999997]
["Net Charging"]
{"$rows_left_out":7}
{"sheet":"T18","index":20,"n_rows":18,"n_cols":6,"rows_kept":18,"cut":false,"hidden":false,"merged":[[0,0,0,4]]}
["Table 18 - Residual Calculation",null,null,null,null,"Return to Index"]
[]
[null,"Component",{"$f":"'T13'!C3","v":"2020/21\nMarch"},{"$f":"'T13'!D3","v":"2020/21 July "},{"$f":"'T13'!E3","v":"2020/21 Draft "},{"$f":"'T13'!F3","v":"2020/21 Final"}]
["G","Proportion of revenue recovered from generation (%)",0.14066658552718692,0.12755843342537185,0.12992177824641785]
["D","Proportion of revenue recovered from demand (%)",0.85933341447281308,0.87244156657462812,0.87007822175358218]
["R","Total TNUoS revenue (£m)",2950.8197852207604,2939.2513033748482,2885.7847911446315]
{"$rows_left_out":13}
{"sheet":"T19","index":21,"n_rows":17,"n_cols":3,"rows_kept":17,"cut":false,"hidden":false,"merged":[[2,0,2,2]]}
["Table 19 - Small Generator Discount"]
[]
["Small Generator Discount calculation"]
["Generator Residual (£/kW)","G",-4.7769008965109583]
["Demand Residual (£/kW)","D",51.88147306665762]
["Small Generator Discount (£/kW)","T = (G + D)/4",11.776142999999999]
{"$rows_left_out":12}
{"sheet":"T20","index":22,"n_rows":18,"n_cols":5,"rows_kept":18,"cut":false,"hidden":false,"merged":[]}
["Table 20 - Summary of in flight CUSC modification proposals",null,null,null,"Return to Index"]
[]
[]
[null,"Name","Title","Effect of proposed change","Possible implementation"]
[null,"CMP280","‘Creation of a New Generator TNUoS Demand Tariff which Removes Liability for TNUoS Demand Residual Charges from Generation and Storage Users'","Change the structure of demand TNUoS charges applied to storage and, potentially other generators."," April 2021, if approved"]
[null,"CMP286","Improving TNUoS Predictability through Increased Notice of the Target Revenue used in the TNUoS Tariff Setting Process v1","Fixes target revenue to be recovered from the TNUoS setting process earlier, to provide more stability to future tariffs."," April 2021, if approved"]
{"$rows_left_out":13}
{"sheet":"T21","index":23,"n_rows":20,"n_cols":8,"rows_kept":20,"cut":false,"hidden":false,"merged":[[4,2,4,3],[4,4,4,5],[4,6,4,7],[4,0,5,1]]}
["Table 21 - Demand HH Locational Tariffs",null,null,null,null,null,"Return to Index"]
[]
[]
[]
["Demand Zone",null,{"$f":"'T18'!D3","v":"2020/21 July "},"2019/20 April",{"$f":"'T18'!E3","v":"2020/21 Draft "},"2019/20 June (£/kW)","Changes"]
[null,null,"Peak (£/kW)","Year Round (£/kW)","Peak (£/kW)","Year Round (£/kW)","Peak (£/kW)","Year Round (£/kW)"]
{"$rows_left_out":15}
{"sheet":"T22","index":24,"n_rows":18,"n_cols":12,"rows_kept":18,"cut":false,"hidden":false,"merged":[[2,0,3,1],[2,2,2,4],[2,5,2,7],[2,8,2,10]]}
["Table 22 - Breakdown of the Embedded Export Tariff",null,null,null,null,null,null,null,null,null,null,"Return to Index"]
[]
["Demand Zone",null,"2020/21 July",null,null,"2020/21 Draft",null,null,"Changes"]
[null,null,"Locational (£/kW)","AGIC (£/kW)","Phased Residual (£/kW)","Locational (£/kW)","AGIC (£/kW)","Phased Residual (£/kW)","Locational (£/kW)","AGIC (£/kW)","Phased Residual (£/kW)"]
[1,"Northern Scotland",-29.174174728864649,3.4270860000000001,0,-30.619490912655706,3.4164949999999998,0,{"$f":"F5-C5","v":-1.4453161837910571},{"$f":"G5-D5","v":-1.0591000000000239E-2},0]
[2,"Southern Scotland",-20.829984925974305,3.4270860000000001,0,-22.982538639007231,3.4164949999999998,0,{"$f":"F6-C6","v":-2.1525537130329262},{"$f":"G6-D6","v":-1.0591000000000239E-2},{"$f":"H6-E6","v":0}]
{"$rows_left_out":13}
{"sheet":"T23","index":25,"n_rows":19,"n_cols":12,"rows_kept":19,"cut":false,"hidden":false,"merged":[[18,0,18,1],[2,0,3,0],[2,1,3,1],[2,2,2,6],[2,7,2,11]]}
["Table 23 - Demand Profiles",null,null,null,null,null,null,"Return to Index"]
[]
["Zone","Zone Name","2020/21 July",null,null,null,null,"2020/21 Draft"]
[null,null,"Locational Model Demand (MW)","GROSS Tariff model Peak Demand (MW)","GROSS Tariff Model HH Demand (MW)","Tariff model NHH Demand (TWh)","Tariff model Embedded Export (MW)","Locational Model Demand (MW)","GROSS Tariff model Peak Demand (MW)","GROSS Tariff Model HH Demand (MW)","Tariff model NHH Demand (TWh)","Tariff model Embedded Export (MW)"]
[1,"Northern Scotland",362.4734783003999,1470,441.41,0.76,1330,266.12454000000002,1470,416.14111459853189,0.78396292555975933,1330]
[2,"Southern Scotland",2643.9817336536357,3360,1229.3800000000001,1.66,870,2398.9954409999996,3360,1159.011580351339,1.7161040013352449,870]
{"$rows_left_out":14}
{"sheet":"T24","index":26,"n_rows":15,"n_cols":5,"rows_kept":15,"cut":false,"hidden":false,"merged":[]}
["Table 24 - Generic Annual Load Factors",null,null,null,"Return to Index"]
[]
[]
["Technology","Generic ALF"]
["Gas_Oil",3.9350000000000001E-3]
["Pumped_Storage",0.102893]
{"$rows_left_out":10}
{"sheet":"T25","index":27,"n_rows":14,"n_cols":5,"rows_kept":14,"cut":false,"hidden":false,"merged":[]}
["Table 25 - Generation Contracted TEC Changes",null,null,null,"Return to Index"]
[]
[]
["Power Station","MW Change","Node","Generation Zone"]
["Aikengall II Windfarm",-76.2,"WDOD10",11]
["Aikengall IIa Wind Farm",81.2,"WDOD10",11]
{"$rows_left_out":9}
{"sheet":"T26-29","index":28,"n_rows":51,"n_cols":22,"rows_kept":51,"cut":false,"hidden":false,"merged":[[2,18,3,21],[2,2,4,2],[2,1,4,1],[2,3,3,6],[2,11,3,14],[2,7,3,10]]}
["Table 26-29 - Revenue Breakdown",null,null,null,null,null,null,"Return to Index"]
[]
["2020/21 Revenue"," ","Licence Term","National Grid Electricity Transmission",null,null,null,"Scottish Power Transmission",null,null,null,"SHE Transmission",null,null,null," ",null,null,"NGESO TNUoS Other Pass-Through"]
["Description",null,null,null,null,null,null,null,null,null,null,null,null,null,null,"Notes"]
["Regulatory Year",null,null,"March Forecast","July Forecast","Nov Draft","Jan Final","March Forecast","July Forecast","Nov Draft","Jan Final","March Forecast","July Forecast","Nov Draft","Jan Final",null,null,"Term","March Forecast","July Forecast","Nov Draft","Jan Final"]
["Opening Base Revenue Allowance (2009/10 prices)","A1","PUt",{"$f":"E6","v":1571.5840000000001},1571.5840000000001,1571.5840000000001,null,254.238,{"$f":"H6","v":254.238},254.238,null,122.5,{"$f":"L6","v":122.5},122.52500000000001,null,"Office of National Statistics",null,"Embedded Offshore Pass-Through (OFETt)",{"$f":"T6","v":0.57547792038461543},0.57547792038461543,{"$f":"T6","v":0.57547792038461543}]
{"$rows_left_out":46}
{"sheet":"T30","index":29,"n_rows":33,"n_cols":9,"rows_kept":33,"cut":false,"hidden":false,"merged":[[2,1,2,7],[22,6,23,6],[20,5,21,5],[3,8,4,8],[14,1,17,1],[17,2,19,2],[18,3,19,3]]}
["Table 30 - Offshore Revenues",null,null,null,null,null,null,null,"Return to Index"]
[]
["Offshore Transmission Revenue Forecast (£m)","2019-11-26"]
[null,null,null,null,null,null,null,null,"Notes"]
["Regulatory Year","2014/15","2015/16","2016/17","2017/18","2018/19","2019/20","2020/21"]
["Barrow",5.4759483870350794,5.6051191659779338,5.6562830188883408,5.8724963671592052,6.250052539232863,6.4376795312597705,6.5679294901075584,"Current revenues plus indexation"]
{"$rows_left_out":28}
{"sheet":"T31","index":30,"n_rows":163,"n_cols":13,"rows_kept":163,"cut":false,"hidden":false,"merged":[[4,0,5,0],[4,1,5,1],[4,2,4,6],[4,7,4,11],[4,12,5,12]]}
["Table 31 - Specific Annual Load Factors",null,null,null,null,null,null,null,null,null,null,"Return to Index"]
[]
[]
[]
["Power Station","Technology","Yearly Load Factor Source",null,null,null,null,"Yearly Load Factor Value",null,null,null,null,"Specific ALF"]
[null,null,2014,2015,2016,2017,2018,2014,2015,2016,2017,2018]
{"$rows_left_out":157}