{"text_format":"1","workbook":"xlsx","n_sheets":30,"sheets":["Index","Residuals","TA","TB","TC & Fig D","TE & Fig F","TG & Fig H","TI","TJ","TK & Fig L","TM","TN","TN A-Z","TO","TP","TQ","TR","TS","TT","TU","TV","TW","TY","TZ","TAA","TBB","TCC","TDD","TEE","TFF"],"not_rendered":{"charts":8,"images":0,"macros":1,"external_links":4,"defined_names":841,"comments":0,"pivot_tables":0},"unopened":[],"bounds":{"document_bytes":16777216,"sheet_cells":100000,"rows_first":2000,"rows_last":500,"rows_between":2000,"halvings":0,"cell_chars":16384,"cell_head_chars":4096},"cells_cut":0,"cells_raw":0,"read":"whole","date_system":"1900"}

{"sheet":"Index","index":0,"n_rows":36,"n_cols":1,"rows_kept":36,"cut":false,"hidden":false,"merged":[]}
["INDEX"]
[{"$f":"Residuals!A1","v":"Residuals and Averages"}]
[{"$f":"TA!A1","v":"Table A - Summary of Demand Tariffs"}]
[{"$f":"TB!A1","v":"Table B - Demand Tariffs"}]
[{"$f":"'TC & Fig D'!A1","v":"Table C - Change in HH Demand Tariffs"}]
[{"$f":"'TE & Fig F'!A1","v":"Table E - Embedded Export Tariff"}]
{"$rows_left_out":31}
{"sheet":"Residuals","index":1,"n_rows":11,"n_cols":5,"rows_kept":11,"cut":false,"hidden":false,"merged":[]}
["Residuals and Averages",null,null,"Return to Index"]
[]
["Residual","2019/20 June","2019/20 Draft","Change since last forecast"]
["Generation",{"$f":"TI!B4","v":-3.6130603651697655},{"$f":"TI!C4","v":-3.5374569999999999},{"$f":"C4-B4","v":7.5603365169765624E-2}]
["Demand",{"$f":"TA!C5","v":51.697066},{"$f":"TA!D5","v":50.822881000000002},{"$f":"C5-B5","v":-0.8741849999999971}]
[]
{"$rows_left_out":6}
{"sheet":"TA","index":2,"n_rows":13,"n_cols":5,"rows_kept":13,"cut":false,"hidden":false,"merged":[]}
["Table A - Summary of Demand Tariffs",null,null,null,"Return to Index"]
[]
[null,"HH Tariffs",{"$f":"Residuals!B3","v":"2019/20 June"},{"$f":"Residuals!C3","v":"2019/20 Draft"},"Change"]
[null,"Average Tariff (£/kW)",50.745111000000001,49.942760999999997,{"$f":"D4-C4","v":-0.80235000000000412}]
[null,"Residual (£/kW)",51.697066,50.822881000000002,{"$f":"D5-C5","v":-0.8741849999999971}]
[null,"EET",{"$f":"C3","v":"2019/20 June"},{"$f":"D3","v":"2019/20 Draft"},{"$f":"E3","v":"Change"}]
{"$rows_left_out":8}
{"sheet":"TB","index":3,"n_rows":19,"n_cols":5,"rows_kept":19,"cut":false,"hidden":false,"merged":[]}
["Table B - Demand Tariffs",null,null,null,"Return to Index"]
[]
["Zone","Zone Name","HH Demand Tariff (£/kW)","NHH Demand Tariff (p/kWh)","Embedded Export Tariff (£/kW)"]
[1,"Northern Scotland",20.395102999999999,2.745374,0]
[2,"Southern Scotland",30.179224000000001,3.9508030000000001,0]
[3,"Northern",40.450515000000003,5.1384359999999996,7.6049020000000001]
{"$rows_left_out":14}
{"sheet":"TC & Fig D","index":4,"n_rows":34,"n_cols":8,"rows_kept":34,"cut":false,"hidden":false,"merged":[]}
["Table C - Change in HH Demand Tariffs",null,null,null,null,"Return to Index",null,"Figure D - Changes to gross HH demand tariffs"]
[]
["Zone","Zone Name",{"$f":"TA!C3&\" (£/kW)\"","v":"2019/20 June (£/kW)"},{"$f":"TA!D3&\" (£/kW)\"","v":"2019/20 Draft (£/kW)"},"Change (£/kW)","Change in Residual (£/kW)"]
[1,"Northern Scotland",21.117249000000001,{"$f":"F21","v":20.395102999999999},{"$f":"D4-C4","v":-0.72214600000000218},{"$f":"Residuals!C5-Residuals!B5","v":-0.8741849999999971}]
[2,"Southern Scotland",28.797132000000001,{"$f":"F22","v":30.179224000000001},{"$f":"D5-C5","v":1.3820920000000001},{"$f":"F4","v":-0.8741849999999971}]
[3,"Northern",41.292129000000003,40.450515000000003,-0.84161399999999986,{"$f":"F5","v":-0.8741849999999971}]
{"$rows_left_out":29}
{"sheet":"TE & Fig F","index":5,"n_rows":34,"n_cols":8,"rows_kept":34,"cut":false,"hidden":false,"merged":[]}
["Table E - Embedded Export Tariff",null,null,null,"Return to Index",null,null,"Figure F - Changes to the EET"]
[]
[]
["Zone","Zone Name",{"$f":"'TC & Fig D'!C3","v":"2019/20 June (£/kW)"},{"$f":"'TC & Fig D'!D3","v":"2019/20 Draft (£/kW)"},"Change (£/kW)"]
[1,"Northern Scotland",{"$f":"MAX(0,TZ!C5+TZ!D5+TZ!E5)","v":0},{"$f":"E21","v":0},{"$f":"D5-C5","v":0}]
[2,"Southern Scotland",{"$f":"MAX(0,TZ!C6+TZ!D6+TZ!E6)","v":0},{"$f":"E22","v":0},{"$f":"D6-C6","v":0}]
{"$rows_left_out":29}
{"sheet":"TG & Fig H","index":6,"n_rows":17,"n_cols":7,"rows_kept":17,"cut":false,"hidden":false,"merged":[]}
["Table G - NHH Demand Tariff Changes",null,null,"Return to Index",null,null,"Figure H - changes to NHH demand tariffs"]
[]
["Zone","Zone Name",{"$f":"Residuals!B3&\" (p/kWh)\"","v":"2019/20 June (p/kWh)"},{"$f":"Residuals!C3&\" (p/kWh)\"","v":"2019/20 Draft (p/kWh)"},"Change (p/kWh)"]
[1,"Northern Scotland",2.8425820000000002,{"$f":"TB!D4","v":2.745374},{"$f":"D4-C4","v":-9.7208000000000183E-2}]
[2,"Southern Scotland",3.7698710000000002,{"$f":"TB!D5","v":3.9508030000000001},{"$f":"D5-C5","v":0.18093199999999987}]
[3,"Northern",5.2453459999999996,{"$f":"TB!D6","v":5.1384359999999996},-0.10691000000000006]
{"$rows_left_out":12}
{"sheet":"TI","index":7,"n_rows":5,"n_cols":6,"rows_kept":5,"cut":false,"hidden":false,"merged":[]}
["Table I - Changes to Average Tariffs",null,null,null,null,"Return to Index"]
[]
["Generation Tariffs (£/kW)",{"$f":"Residuals!B3","v":"2019/20 June"},{"$f":"Residuals!C3","v":"2019/20 Draft"},"Change since last forecast"]
["Residual",-3.6130603651697655,{"$f":"TJ!F5","v":-3.5374569999999999},{"$f":"C4-B4","v":7.5603365169765624E-2}]
["Average Generation Tariff",5.6112696379735949,5.5030850673754816,{"$f":"C5-B5","v":-0.10818457059811326},"N.B. These generation average tariffs include local tariffs"]

{"sheet":"TJ","index":8,"n_rows":31,"n_cols":9,"rows_kept":31,"cut":false,"hidden":false,"merged":[[32,6,32,7],[1,6,1,8]]}
["Table J - Generation Wider Tariffs",null,null,null,null,null,null,null,"Return to Index"]
[null,null,null,null,null,null,"Example tariffs for a generator of each technology type:"]
[null,null,"System Peak","Shared \nYear Round","Not Shared Year Round","Residual","Conventional Carbon 80%","Conventional Low Carbon 80%","Intermittent 40%"]
["Zone","Zone Name","Tariff\n(£/kW)","Tariff\n(£/kW)","Tariff\n(£/kW)","Tariff\n(£/kW)","Tariff\n(£/kW)","Tariff\n(£/kW)","Tariff\n(£/kW)"]
[1,"North Scotland",2.2805430000000002,17.691649000000002,15.483853999999999,-3.5374569999999999,25.283488400000003,28.380259200000001,19.0230566]
[2,"East Aberdeenshire",4.3932200000000003,9.2201240000000002,15.483853999999999,-3.5374569999999999,20.618945400000001,23.715716199999999,15.6344466]
{"$rows_left_out":26}
{"sheet":"TK & Fig L","index":9,"n_rows":35,"n_cols":12,"rows_kept":35,"cut":false,"hidden":false,"merged":[[3,0,3,11],[4,2,4,4],[4,8,4,10],[4,11,5,11],[0,0,0,10],[4,5,4,7]]}
["Table K - Generation Tariff Changes",null,null,null,null,null,null,null,null,null,null,"Return to Index"]
[]
[]
["Wider Generation Tariffs (£/kW)"]
[null,null,"Conventional Carbon 80%",null,null,"Conventional Low Carbon 80%",null,null,"Intermittent 40%",null,null,"Change in Residual (£/kW)"]
["Zone","Zone Name",{"$f":"Residuals!B3&\" (£/kW)\"","v":"2019/20 June (£/kW)"},{"$f":"Residuals!C3&\" (£/kW)\"","v":"2019/20 Draft (£/kW)"},"Change (£/kW)",{"$f":"C6","v":"2019/20 June (£/kW)"},{"$f":"D6","v":"2019/20 Draft (£/kW)"},"Change (£/kW)",{"$f":"F6","v":"2019/20 June (£/kW)"},{"$f":"G6","v":"2019/20 Draft (£/kW)"},"Change (£/kW)"]
{"$rows_left_out":30}
{"sheet":"TM","index":10,"n_rows":9,"n_cols":5,"rows_kept":9,"cut":false,"hidden":false,"merged":[[3,0,4,0],[3,1,4,1],[2,0,2,4],[3,2,4,2],[3,3,4,3],[3,4,4,4]]}
["Table M - Local Substation Tariffs",null,null,null,"Return to Index"]
[]
[{"$f":"Index!J11&\" Local Substation Tariff (£/kW)\"","v":" Local Substation Tariff (£/kW)"}]
["Substation\nRating","Connection\nType","132kV","275kV","400kV"]
[]
["<1320 MW","No redundancy",0.197964,0.113248,8.1598000000000004E-2]
{"$rows_left_out":4}
{"sheet":"TN","index":11,"n_rows":28,"n_cols":8,"rows_kept":28,"cut":false,"hidden":false,"merged":[[0,0,0,5]]}
["Table N - Onshore Local Circuit Tariffs",null,null,null,null,null,null,"Return to Index"]
[]
["Substation Name","(£/kW)","Substation Name","(£/kW)","Substation Name","(£/kW)"]
["Achruach",4.2336660000000004,"Dunhill",1.412272,"Luichart",0.56596900000000006]
["Aigas",0.644872,"Dumnaglass",1.830606,"Mark Hill",0.86331100000000005]
["An Suidhe",3.0023879999999998,"Edinbane",6.7491469999999998,"Marchwood",0.37629800000000002]
{"$rows_left_out":23}
{"sheet":"TN A-Z","index":12,"n_rows":29,"n_cols":8,"rows_kept":29,"cut":false,"hidden":false,"merged":[]}
["Table N - Onshore Local Circuit Tariffs",null,null,null,null,null,null,"Return to Index"]
[]
["Substation Name","(£/kW)","Substation Name","(£/kW)","Substation Name","(£/kW)"]
["Achruach",{"$f":"IF(ISNA(VLOOKUP(A4,TN!$A$4:$B$28,2,0)),IF(ISNA(VLOOKUP(A4,TN!$C$4:$D$28,2,0)),VLOOKUP(A4,TN!$E$4:$F$28,2,0),VLOOKUP(A4,TN!$C$4:$D$28,2,0)),VLOOKUP(A4,TN!$A$4:$B$28,2,0))","v":4.2336660000000004},"Dunhill",{"$f":"IF(ISNA(VLOOKUP(C4,TN!$A$4:$B$28,2,0)),IF(ISNA(VLOOKUP(C4,TN!$C$4:$D$28,2,0)),VLOOKUP(C4,TN!$E$4:$F$28,2,0),VLOOKUP(C4,TN!$C$4:$D$28,2,0)),VLOOKUP(C4,TN!$A$4:$B$28,2,0))","v":1.412272},"Lochay",{"$f":"IF(ISNA(VLOOKUP(E4,TN!$A$4:$B$28,2,0)),IF(ISNA(VLOOKUP(E4,TN!$C$4:$D$28,2,0)),VLOOKUP(E4,TN!$E$4:$F$28,2,0),VLOOKUP(E4,TN!$C$4:$D$28,2,0)),VLOOKUP(E4,TN!$A$4:$B$28,2,0))","v":0.36081999999999997}]
["Aberdeen Bay",{"$f":"IF(ISNA(VLOOKUP(A5,TN!$A$4:$B$28,2,0)),IF(ISNA(VLOOKUP(A5,TN!$C$4:$D$28,2,0)),VLOOKUP(A5,TN!$E$4:$F$28,2,0),VLOOKUP(A5,TN!$C$4:$D$28,2,0)),VLOOKUP(A5,TN!$A$4:$B$28,2,0))","v":2.5708440000000001},"Dunlaw Extension",{"$f":"IF(ISNA(VLOOKUP(C5,TN!$A$4:$B$28,2,0)),IF(ISNA(VLOOKUP(C5,TN!$C$4:$D$28,2,0)),VLOOKUP(C5,TN!$E$4:$F$28,2,0),VLOOKUP(C5,TN!$C$4:$D$28,2,0)),VLOOKUP(C5,TN!$A$4:$B$28,2,0))","v":1.4814970000000001},"Luichart",{"$f":"IF(ISNA(VLOOKUP(E5,TN!$A$4:$B$28,2,0)),IF(ISNA(VLOOKUP(E5,TN!$C$4:$D$28,2,0)),VLOOKUP(E5,TN!$E$4:$F$28,2,0),VLOOKUP(E5,TN!$C$4:$D$28,2,0)),VLOOKUP(E5,TN!$A$4:$B$28,2,0))","v":0.56596900000000006}]
["Aigas",{"$f":"IF(ISNA(VLOOKUP(A6,TN!$A$4:$B$28,2,0)),IF(ISNA(VLOOKUP(A6,TN!$C$4:$D$28,2,0)),VLOOKUP(A6,TN!$E$4:$F$28,2,0),VLOOKUP(A6,TN!$C$4:$D$28,2,0)),VLOOKUP(A6,TN!$A$4:$B$28,2,0))","v":0.644872},"Edinbane",{"$f":"IF(ISNA(VLOOKUP(C6,TN!$A$4:$B$28,2,0)),IF(ISNA(VLOOKUP(C6,TN!$C$4:$D$28,2,0)),VLOOKUP(C6,TN!$E$4:$F$28,2,0),VLOOKUP(C6,TN!$C$4:$D$28,2,0)),VLOOKUP(C6,TN!$A$4:$B$28,2,0))","v":6.7491469999999998},"Marchwood",{"$f":"IF(ISNA(VLOOKUP(E6,TN!$A$4:$B$28,2,0)),IF(ISNA(VLOOKUP(E6,TN!$C$4:$D$28,2,0)),VLOOKUP(E6,TN!$E$4:$F$28,2,0),VLOOKUP(E6,TN!$C$4:$D$28,2,0)),VLOOKUP(E6,TN!$A$4:$B$28,2,0))","v":0.37629800000000002}]
{"$rows_left_out":24}
{"sheet":"TO","index":13,"n_rows":17,"n_cols":5,"rows_kept":17,"cut":false,"hidden":false,"merged":[]}
["Table O - CMP203: Circuits subject to one-off charges",null,null,null,"Return to Index"]
[]
["Node 1","Node 2","Actual Parameters","Amendment in Transport Model","Generator"]
["Dyce 132kV","Aberdeen Bay 132kV","9.5km of Cable","9.5km of OHL","Aberdeen Bay"]
["Crystal Rig 132kV","Wester Dod 132kV","3.9km of Cable","3.9km of OHL","Aikengall II"]
["Wishaw 132kV","Blacklaw 132kV","11.46km of Cable","11.46km of OHL","Blacklaw"]
{"$rows_left_out":12}
{"sheet":"TP","index":14,"n_rows":22,"n_cols":4,"rows_kept":22,"cut":false,"hidden":false,"merged":[[2,0,3,0],[2,1,2,3]]}
["Table P - Offshore Local Tariffs",null,null,"Return to Index"]
[]
["Offshore Generator","Tariff Component (£/kW)"]
[null,"Substation","Circuit","ETUoS"]
["Barrow",7.9773300000000003,41.737380000000002,1.0363960000000001]
["Burbo Bank",10.335699,19.789100999999999,0]
{"$rows_left_out":17}
{"sheet":"TQ","index":15,"n_rows":6,"n_cols":7,"rows_kept":6,"cut":false,"hidden":false,"merged":[[0,0,0,4]]}
["Table Q - Contracted and Modelled TEC",null,null,null,null,"Return to Index"]
[]
["Generation (GW)","2018/19","2019/20 Initial Forecast","2019/20 April Forecast","2019/20 June Forecast","2019/20 Draft Tariffs","2019/20 Final Tariffs"]
["Contracted TEC",79.028809999999993,85.464610000000022,{"$f":"85938.76/1000","v":85.938759999999988},83.9,80.556650000000005]
["Modelled Best View TEC",79.028809999999993,77.680610000000016,{"$f":"77496.86/1000","v":77.496859999999998},77.7,80.556650000000005]
["Chargeable TEC",71.934310000000025,73.833610000000022,{"$f":"71711.76/1000","v":71.711759999999998},71.900000000000006,73.324650000000005]
{"$rows_left_out":1}
{"sheet":"TR","index":16,"n_rows":10,"n_cols":7,"rows_kept":10,"cut":false,"hidden":false,"merged":[]}
["Table R - Interconnectors",null,null,null,null,null,"Return to Index"]
[]
["Interconnector","Site","Interconnected\nSystem","Generation\nZone","Transport Model (Generation MW) Peak","Transport Model (Generation MW) Year Round","Charging Base (Generation MW)"]
["IFA Interconnector","Sellindge 400kV","France",24,0,2000,0]
["IFA2","Chilling 400kV","France",26,0,1100,0]
["ElecLink","Sellindge 400kV","France",24,0,1000,0]
{"$rows_left_out":5}
{"sheet":"TS","index":17,"n_rows":24,"n_cols":7,"rows_kept":24,"cut":false,"hidden":false,"merged":[[2,0,3,0],[2,2,2,6]]}
["Table S - Allowed Revenues",null,null,null,null,null,"Return to Index"]
[]
["£m Nominal Value","2018/19 TNUoS Revenue","2019/20 TNUoS Revenue"]
[null,{"$f":"TEE!D5","v":"2018/19 (fixed forecast)"},{"$f":"TEE!E5","v":"Initial Forecast"},{"$f":"TEE!F5","v":"April Forecast"},{"$f":"TEE!G5","v":"June Forecast"},{"$f":"TEE!H5","v":"Nov Draft"},"Jan \n2019 Final"]
["National Grid"]
["Price controlled revenue",1653.9179700263246,1768.5197291650261,1728.1223686166347,1770.6013999438635,{"$f":"F8+F7","v":1737.7075641887611}]
{"$rows_left_out":19}
{"sheet":"TT","index":18,"n_rows":12,"n_cols":7,"rows_kept":12,"cut":false,"hidden":false,"merged":[[0,0,0,5]]}
["Table T - Generation and Demand Revenue Proportions",null,null,null,null,null,"Return to Index"]
[]
[null,null,{"$f":"TQ!C3","v":"2019/20 Initial Forecast"},{"$f":"TQ!D3","v":"2019/20 April Forecast"},{"$f":"TQ!E3","v":"2019/20 June Forecast"},{"$f":"TQ!F3","v":"2019/20 Draft Tariffs"},{"$f":"TQ!G3","v":"2019/20 Final Tariffs"}]
["CAPEC","Limit on generation tariff (€/MWh)",2.5,2.5,2.5,2.5]
["y","Error Margin",0.21,0.21,0.21,0.21]
["ER","Exchange Rate (€/£)",1.0900000000000001,1.1299999999999999,1.124927,1.124927]
{"$rows_left_out":7}
{"sheet":"TU","index":19,"n_rows":12,"n_cols":5,"rows_kept":12,"cut":false,"hidden":false,"merged":[]}
["Table U - Charging Bases",null,null,null,"Return to Index"]
[]
["Charging Bases",{"$f":"TQ!D3","v":"2019/20 April Forecast"},{"$f":"TQ!E3","v":"2019/20 June Forecast"},{"$f":"TQ!F3","v":"2019/20 Draft Tariffs"},{"$f":"TQ!G3","v":"2019/20 Final Tariffs"}]
["Generation (GW)",71.711759999999984,71.910959999999989,73.324649999999991]
["NHH Demand (4pm-7pm TWh)",25.512098981321838,25.512098981321838,25.512098981321838]
["Net Charging"]
{"$rows_left_out":7}
{"sheet":"TV","index":20,"n_rows":18,"n_cols":6,"rows_kept":18,"cut":false,"hidden":false,"merged":[[0,0,0,4]]}
["Table V - Residual Calculation",null,null,null,null,"Return to Index"]
[]
[null,"Component",{"$f":"TQ!D3","v":"2019/20 April Forecast"},{"$f":"TQ!E3","v":"2019/20 June Forecast"},{"$f":"TQ!F3","v":"2019/20 Draft Tariffs"},{"$f":"TQ!G3","v":"2019/20 Final Tariffs"}]
["G","Proportion of revenue recovered from generation (%)",0.15225422987595572,0.14014464841765573,0.14210391633203351]
["D","Proportion of revenue recovered from demand (%)",0.84774577012404428,0.85985535158234427,0.85789608366796655]
["R","Total TNUoS revenue (£m)",2835.8126099188039,2879.2521943684746,2839.5542987197236]
{"$rows_left_out":13}
{"sheet":"TW","index":21,"n_rows":17,"n_cols":3,"rows_kept":17,"cut":false,"hidden":false,"merged":[[2,0,2,2],[0,0,0,4]]}
["Table W - Small Generator Discount"]
[]
["Small Generator Discount Calculation"]
["Generator Residual (£/kW)","G",-3.5374568044202417]
["Demand Residual (£/kW)","D",50.822880972832635]
["Small Generator Discount (£/kW)","T = (G + D)/4",11.821356]
{"$rows_left_out":12}
{"sheet":"TY","index":22,"n_rows":20,"n_cols":7,"rows_kept":20,"cut":false,"hidden":false,"merged":[[4,0,5,0],[4,1,4,2],[4,3,4,4],[4,5,4,6]]}
["Table Y - Demand Locational Tariffs",null,null,null,null,null,"Return to Index"]
[]
[]
[]
["Zone",{"$f":"Residuals!B3","v":"2019/20 June"},"2019/20 April",{"$f":"Residuals!C3","v":"2019/20 Draft"},"2019/20 June (£/kW)","Changes"]
[null,"Peak (£/kW)","Year Round (£/kW)","Peak (£/kW)","Year Round (£/kW)","Peak (£/kW)","Year Round (£/kW)"]
{"$rows_left_out":15}
{"sheet":"TZ","index":23,"n_rows":18,"n_cols":12,"rows_kept":18,"cut":false,"hidden":false,"merged":[[2,0,3,1],[2,2,2,4],[2,5,2,7],[2,8,2,10]]}
["Table Z - Breakdown of the Embedded Export Tariff",null,null,null,null,null,null,null,null,null,null,"Return to Index"]
[]
["Demand Zone",null,{"$f":"Residuals!B3","v":"2019/20 June"},null,null,{"$f":"Residuals!C3","v":"2019/20 Draft"},null,null,"Changes"]
[null,null,"Locational (£/kW)","AGIC (£/kW)","Phased Residual (£/kW)","Locational (£/kW)","AGIC (£/kW)","Phased Residual (£/kW)","Locational (£/kW)","AGIC (£/kW)","Phased Residual (£/kW)"]
[1,"Northern Scotland",-30.579816999999998,3.3272680000000001,14.65,-30.427778358021104,3.3272680000000001,14.65,{"$f":"F5-C5","v":0.15203864197889416},{"$f":"G5-D5","v":0},0]
[2,"Southern Scotland",-22.899933999999998,3.3272680000000001,14.65,-20.643656794991578,3.3272680000000001,14.65,{"$f":"F6-C6","v":2.2562772050084199},{"$f":"G6-D6","v":0},{"$f":"H6-E6","v":0}]
{"$rows_left_out":13}
{"sheet":"TAA","index":24,"n_rows":19,"n_cols":12,"rows_kept":19,"cut":false,"hidden":false,"merged":[[18,0,18,1],[2,0,3,0],[2,1,3,1],[2,2,2,6],[2,7,2,11]]}
["Table AA - Demand Profiles",null,null,null,null,null,null,"Return to Index"]
[]
["Zone","Zone Name",{"$f":"Residuals!B3","v":"2019/20 June"},null,null,null,null,{"$f":"Residuals!C3","v":"2019/20 Draft"}]
[null,null,"Locational Model Demand (MW)","GROSS Tariff model Peak Demand (MW)","GROSS Tariff Model HH Demand (MW)","Tariff model NHH Demand (TWh)","Tariff model Embedded Export (MW)","Locational Model Demand (MW)","GROSS Tariff model Peak Demand (MW)","GROSS Tariff Model HH Demand (MW)","Tariff model NHH Demand (TWh)","Tariff model Embedded Export (MW)"]
[1,"Northern Scotland",499.4470878504585,1483.1581980599999,427.58099095348541,0.78417740827603,958.03354100000001,716,1483.1581980599999,427.58099095348541,0.78417740827603,958.03354100000001]
[2,"Southern Scotland",2695.2802337591597,3444.3512881749998,1125.6193456983801,1.7712229685994472,678.45211199999994,2961,3444.3512881749998,1125.6193456983801,1.7712229685994472,678.45211199999994]
{"$rows_left_out":14}
{"sheet":"TBB","index":25,"n_rows":153,"n_cols":13,"rows_kept":153,"cut":false,"hidden":false,"merged":[[4,0,5,0],[4,1,5,1],[4,2,4,6],[4,7,4,11],[4,12,5,12]]}
["Table BB - Annual Load Factors",null,null,null,null,null,null,null,null,null,null,"Return to Index"]
[]
[]
[]
["Power Station","Technology","Yearly Load Factor Source",null,null,null,null,"Yearly Load Factor Value",null,null,null,null,"Specific ALF"]
[null,null,2013,2014,2015,2016,2017,2013,2014,2015,2016,2017]
{"$rows_left_out":148}
{"sheet":"TCC","index":26,"n_rows":15,"n_cols":5,"rows_kept":15,"cut":false,"hidden":false,"merged":[]}
["Table CC - Generic Annual Load Factors",null,null,null,"Return to Index"]
[]
[]
["Technology","Generic ALF"]
["Biomass",0.268847]
["CCGT_CHP",0.48637900000000001]
{"$rows_left_out":10}
{"sheet":"TDD","index":27,"n_rows":17,"n_cols":5,"rows_kept":17,"cut":false,"hidden":false,"merged":[]}
["Table DD - Generation Contracted TEC Changes",null,null,null,"Return to Index"]
[]
[]
["Power Station","MW Change","Node","Generation Zone"]
["Auchencrosh (interconnector CCT)",227,"AUCH20",10]
["Carnedd Wen Wind Farm",-150,"TRAW40",18]
{"$rows_left_out":12}
{"sheet":"TEE","index":28,"n_rows":43,"n_cols":9,"rows_kept":43,"cut":false,"hidden":false,"merged":[]}
["Table EE - Indicative National Grid Revenue Forecast",null,null,null,null,null,null,null,"Return to Index"]
[]
[null,null,null,null,null,null,null,null," "]
["Description"," ",null,null,null,null,null,null,"Notes"]
["Regulatory Year"," ","Licence Term","2018/19 (fixed forecast)","Initial Forecast","April Forecast","June Forecast","Nov Draft"]
["Actual RPI"," "," "," ",null,null,null,null,"April to March average"]
{"$rows_left_out":38}
{"sheet":"TFF","index":29,"n_rows":31,"n_cols":11,"rows_kept":31,"cut":false,"hidden":false,"merged":[[2,1,2,6],[20,5,21,5],[3,7,4,7],[14,1,17,1],[17,2,19,2],[18,3,19,3],[21,6,22,6]]}
["Table FF - Offshore Revenues",null,null,null,null,null,null,"Return to Index"]
[]
["Offshore Transmission Revenue Forecast (£m)","2018-11-23",null,null,null,null,null,null,null,null," "]
[null,null,null,null,null,null,null,"Notes"]
["Regulatory Year","2014/15","2015/16","2016/17","2017/18","2018/19","2019/20"]
["Barrow",5.4759483870350794,5.6051191659779338,5.6562830188883408,5.8724963671592052,6.250052539232863,6.4415396739902615,"Current revenues plus indexation"]
{"$rows_left_out":25}