{"text_format":"1","workbook":"xlsx","n_sheets":4,"sheets":["Submission Sheet","Auto","Calendar","Drop down boxes"],"not_rendered":{"charts":0,"images":0,"macros":1,"external_links":1,"defined_names":2,"comments":1,"pivot_tables":0},"unopened":[],"bounds":{"document_bytes":16777216,"sheet_cells":100000,"rows_first":2000,"rows_last":500,"rows_between":2000,"halvings":0,"cell_chars":16384,"cell_head_chars":4096},"cells_cut":0,"cells_raw":0,"read":"whole","date_system":"1900"}

{"sheet":"Submission Sheet","index":0,"n_rows":418,"n_cols":42,"rows_kept":418,"cut":false,"hidden":false,"merged":[[410,0,417,0],[410,3,410,6],[411,1,414,1],[411,2,414,3],[3,41,5,41],[4,11,4,13],[4,14,4,16],[4,17,4,19],[4,20,5,20],[4,21,5,21],[4,22,5,22],[4,23,5,23],[4,25,5,25],[4,26,5,26],[4,27,5,27],[4,28,5,28],[4,39,4,40],[3,29,4,35],[3,36,5,36],[3,37,5,37],[3,38,5,38],[3,39,3,40],[3,25,3,28],[3,0,5,0],[3,1,5,1],[3,2,5,2],[3,3,5,3],[3,4,5,4],[3,5,5,5],[3,6,5,6],[3,7,5,7],[3,8,5,8],[3,9,5,9],[3,10,5,10],[3,11,3,19],[3,20,3,23],[3,24,5,24]]}
["Indication of FFR results for tender round 105, accepted tenders will be officially notified via issued acceptance letter"]
[]
[]
["Tender Ref","Status","Rejection Code","Company Name","Tendered Unit \n(BMU/Unit ID)","TO connection  /  DNO connection","Generation Type","Start Date","End Date","Tendered Period \n(dd.mm.yy - dd.mm.yy)","Applicable FFR Capability Data Table","Tendered Frames per Service Day",null,null,null,null,null,null,null,null,"Tendered Prices***",null,null,null,"BMUs  Only - Applicable Balancing Service           (i.e. ABSVD Imbalance) YES/NO","Dynamic Providers Only",null,null,null,"Dynamic Providers only",null,null,null,null,null,null,"Please indicate as per detail change provision if you are adding volume","Please state the accepted tender that you are stacking onto","Please state if this is an all or nothing bid.\n\nClearly reference what lines are included in each all or nothing bid","Non-Dynamic Providers  ",null,"Comments "]
[null,null,null,null,null,null,null,null,null,null,null,"Working Days \n(Mon-Fri)",null,null,"Saturdays",null,null,"Sundays/Bank Holidays",null,null,"Availability Fee (£/h)","Nomination Fee (£/h)","Window Initiation Fee (£/window)","Response Energy Fee (Non-BM only) (£/MW/h)",null,"Maximum Part Load Point (MW)","Minimum Part Load Point (MW)","Minimum MEL (MW)","Maximum SEL (MW)",null,null,null,null,null,null,null,null,null,null,"Volume of Response Tendered"]
[null,null,null,null,null,null,null,null,null,null,null,"From","To","Duration (h)","From","To","Duration (h)","From","To","Duration (h)",null,null,null,null,null,null,null,null,null,"Primary Response (max.) @ 0.2Hz (MW)","Primary Response (max.) @ 0.5Hz (MW)","Primary Response (max.) @ 0.8Hz (MW)","Secondary Response (max.) @ 0.2/0.2Hz (MW)","Secondary Response (max.) @ 0.5/0.5Hz (MW)","High Frequency Response (max.) @ 0.2Hz (MW)","High Frequency Response (max.) @ 0.5Hz (MW)",null,null,null,"Automatic Response Energy Deliverable by 10s (MW)","Automatic Response Energy Deliverable by 30s (MW)"]
[105,null,null,"Example Company","Ex-FFR-1","TO connection","Wind",{"$f":"'[1]Drop down boxes'!D3","v":"2018-10-01"},{"$f":"'[1]Drop down boxes'!E2","v":"2018-10-31"},{"$f":"IFERROR(TEXT(H7,\"DD.MM.YY\")&\" - \"&TEXT(I7,\"DD.MM.YY\")&\" (\"&DATEDIF(H7,I7+1,\"m\")&\" months)\",\"Tender End Date is Before Start Date\")","v":"01.10.18 - 31.10.18 (1 months)"},"As per FFR framework agreement ",2300,700,{"$f":"IF(L7>M7, (2400-L7+M7)/100, IF(AND(L7=\"\",M7=\"\",L7=M7), \"\", IF(L7=M7,24,(M7-L7)/100)))","v":8},2300,700,{"$f":"IF(O7>P7, (2400-O7+P7)/100, IF(AND(O7=\"\",P7=\"\",O7=P7), \"\", IF(O7=P7,24,(P7-O7)/100)))","v":8},2300,700,{"$f":"IF(R7>S7, (2400-R7+S7)/100, IF(AND(R7=\"\",S7=\"\",R7=S7), \"\", IF(R7=S7,24,(S7-R7)/100)))","v":8},100,600,"-","-","-","-","-","-","-","-","-","-","-","-","-","-","-","-",null,"-","-","-"]
[{"$f":"A7","v":105},null,null,"Example Company",{"$f":"E7","v":"Ex-FFR-1"},"DNO connection","Gas",{"$f":"H7","v":"2018-10-01"},{"$f":"I7","v":"2018-10-31"},{"$f":"IFERROR(TEXT(H8,\"DD.MM.YY\")&\" - \"&TEXT(I8,\"DD.MM.YY\")&\" (\"&DATEDIF(H8,I8+1,\"m\")&\" months)\",\"Tender End Date is Before Start Date\")","v":"01.10.18 - 31.10.18 (1 months)"},"As per FFR framework agreement ",700,2300,{"$f":"IF(L8>M8, (2400-L8+M8)/100, IF(AND(L8=\"\",M8=\"\",L8=M8), \"\", IF(L8=M8,24,(M8-L8)/100)))","v":16},700,2300,{"$f":"IF(O8>P8, (2400-O8+P8)/100, IF(AND(O8=\"\",P8=\"\",O8=P8), \"\", IF(O8=P8,24,(P8-O8)/100)))","v":16},700,2300,{"$f":"IF(R8>S8, (2400-R8+S8)/100, IF(AND(R8=\"\",S8=\"\",R8=S8), \"\", IF(R8=S8,24,(S8-R8)/100)))","v":16},600,100,"-","-","-","-","-","-","-","-","-","-","-","-","-","-","-","-",null,"-","-","-"]
[{"$f":"A7+0.001","v":105.001},"Reject",1.3,"Arenko Cleantech Limited","AR02-FFR","DNO connection","Battery","2019-03-31","2019-09-30","31.03.19 - 30.09.19 (6 months)","As per FFR framework agreement ",2300,700,8,2300,700,8,2300,700,8,219.35,"-","-","-","-","-","-","-","-",16.399999999999999,41,41,16.399999999999999,41,"-","-","-","-","-","-","-","-"]
[{"$f":"A9+0.001","v":105.00200000000001},"Reject",1.3,"Arenko Cleantech Limited","AR02-FFR","DNO connection","Battery","2019-09-30","2020-03-31","30.09.19 - 31.03.20 (6 months)","As per FFR framework agreement ",2300,700,8,2300,700,8,2300,700,8,227.55,"-","-","-","-","-","-","-","-",16.399999999999999,41,41,16.399999999999999,41,"-","-","-","-","-","-","-","-"]
[105.00300000000001,"Reject",1.3,"Arenko Cleantech Limited","AR02-FFR","DNO connection","Battery","2020-03-31","2020-09-30","31.03.20 - 30.09.20 (6 months)","As per FFR framework agreement ",2300,700,8,2300,700,8,2300,700,8,219.35,"-","-","-","-","-","-","-","-",16.399999999999999,41,41,16.399999999999999,41,"-","-","-","-","-","-","-","-"]
[105.00400000000002,"Reject",1.3,"Arenko Cleantech Limited","AR02-FFR","DNO connection","Battery","2020-09-30","2021-03-31","30.09.20 - 31.03.21 (6 months)","As per FFR framework agreement ",2300,700,8,2300,700,8,2300,700,8,227.55,"-","-","-","-","-","-","-","-",16.399999999999999,41,41,16.399999999999999,41,"-","-","-","-","-","-","-","-"]
[105.00500000000002,"Reject",4,"BESS HoldCo 3 Ltd","DBESS-33","DNO connection","Battery","2018-09-30","2019-03-31","30.09.18 - 31.03.19 (6 months)","As per FFR framework agreement ",2300,700,8,2300,700,8,2300,700,8,{"$f":"6.65*AF13","v":192.85000000000002},null,null,null,null,null,null,null,null,14,29,29,14,29,14,29,null,null,"A",null,null,"Cannot be accepted with B,H or I"]
[105.00600000000003,"Reject",4,"BESS HoldCo 3 Ltd","DBESS-33","DNO connection","Battery","2018-09-30","2019-03-31","30.09.18 - 31.03.19 (6 months)","As per FFR framework agreement ",2300,1500,16,2300,2300,24,2300,2300,24,192.85000000000002,null,null,null,null,null,null,null,null,14,29,29,14,29,14,29,null,null,"B",null,null,"Cannot be accepted with A,H or I"]
[105.00700000000003,"Reject",1.3,"BESS HoldCo 3 Ltd","DBESS-33","DNO connection","Battery","2019-03-31","2019-09-30","31.03.19 - 30.09.19 (6 months)","As per FFR framework agreement ",2300,2300,24,2300,2300,24,2300,2300,24,192.85000000000002,null,null,null,null,null,null,null,null,14,29,29,14,29,14,29,null,null,"C",null,null,"Cannot be accepted with G"]
[105.00800000000004,"Reject",1.3,"BESS HoldCo 3 Ltd","DBESS-33","DNO connection","Battery","2019-09-30","2020-03-31","30.09.19 - 31.03.20 (6 months)","As per FFR framework agreement ",2300,700,8,2300,700,8,2300,700,8,192.85000000000002,null,null,null,null,null,null,null,null,14,29,29,14,29,14,29,null,null,"D",null,null,"Cannot be accepted with G"]
[105.00900000000004,"Reject",1.3,"BESS HoldCo 3 Ltd","DBESS-33","DNO connection","Battery","2020-03-31","2020-09-30","31.03.20 - 30.09.20 (6 months)","As per FFR framework agreement ",2300,2300,24,2300,2300,24,2300,2300,24,192.85000000000002,null,null,null,null,null,null,null,null,14,29,29,14,29,14,29,null,null,"E",null,null,"Cannot be accepted with G"]
[105.01000000000005,"Reject",1.1000000000000001,"BESS HoldCo 3 Ltd","DBESS-33","DNO connection","Battery","2020-09-30","2021-03-31","30.09.20 - 31.03.21 (6 months)","As per FFR framework agreement ",2300,700,8,2300,700,8,2300,700,8,192.85000000000002,null,null,null,null,null,null,null,null,14,29,29,14,29,14,29,null,null,"F",null,null,"Cannot be accepted with G"]
[105.01100000000005,"Reject",1.3,"BESS HoldCo 3 Ltd","DBESS-33","DNO connection","Battery","2019-03-31","2021-03-31","31.03.19 - 31.03.21 (24 months)","As per FFR framework agreement ",2300,2300,24,2300,2300,24,2300,2300,24,{"$f":"(6.65/2+5.82/2)*AF19","v":180.815},null,null,null,null,null,null,null,null,14,29,29,14,29,14,29,null,null,"G",null,null,"Cannot be accepted with C,D,E or F"]
[105.01200000000006,"Accepted","N/A","BESS HoldCo 3 Ltd","DBESS-33","DNO connection","Battery","2018-09-30","2018-12-31","30.09.18 - 31.12.18 (3 months)","As per FFR framework agreement ",2300,700,8,2300,700,8,2300,700,8,{"$f":"6.65*AF20","v":192.85000000000002},null,null,null,null,null,null,null,null,14,29,29,14,29,14,29,null,null,"H",null,null,"Cannot be accepted with A,B or I"]
[105.01300000000006,"Reject",4,"BESS HoldCo 3 Ltd","DBESS-33","DNO connection","Battery","2018-09-30","2018-12-31","30.09.18 - 31.12.18 (3 months)","As per FFR framework agreement ",2300,1500,16,2300,2300,24,2300,2300,24,{"$f":"6.65*AF21","v":192.85000000000002},null,null,null,null,null,null,null,null,14,29,29,14,29,14,29,null,null,"I",null,null,"Cannot be accpeted with A,B or H"]
[105.01400000000007,"Reject",1.3,"BESS HoldCo 2 Ltd","DBESS-22","DNO connection","Battery","2019-03-31","2019-09-30","31.03.19 - 30.09.19 (6 months)","As per FFR framework agreement ",2300,2300,24,2300,2300,24,2300,2300,24,{"$f":"6.5*AF22","v":65},null,null,null,null,null,null,null,null,{"$f":"0.4*AE22","v":4},10,10,{"$f":"0.4*AH22","v":4},10,{"$f":"0.4*AJ22","v":4},10,null,null,"A",null,null,"Cannot be accepted with E"]
[105.01500000000007,"Reject",1.3,"BESS HoldCo 2 Ltd","DBESS-22","DNO connection","Battery","2019-09-30","2020-03-31","30.09.19 - 31.03.20 (6 months)","As per FFR framework agreement ",2300,700,8,2300,700,8,2300,700,8,{"$f":"6.5*AF23","v":65},null,null,null,null,null,null,null,null,{"$f":"0.4*AE23","v":4},10,10,{"$f":"0.4*AH23","v":4},10,{"$f":"0.4*AJ23","v":4},10,null,null,"B",null,null,"Cannot be accepted with E"]
[105.01600000000008,"Reject",1.3,"BESS HoldCo 2 Ltd","DBESS-22","DNO connection","Battery","2020-03-31","2020-09-30","31.03.20 - 30.09.20 (6 months)","As per FFR framework agreement ",2300,2300,24,2300,2300,24,2300,2300,24,{"$f":"6.5*AF24","v":65},null,null,null,null,null,null,null,null,{"$f":"0.4*AE24","v":4},10,10,{"$f":"0.4*AH24","v":4},10,{"$f":"0.4*AJ24","v":4},10,null,null,"C",null,null,"Cannot be accepted with E"]
[105.01700000000008,"Accepted","N/A","BESS HoldCo 2 Ltd","DBESS-22","DNO connection","Battery","2020-09-30","2021-03-31","30.09.20 - 31.03.21 (6 months)","As per FFR framework agreement ",2300,700,8,2300,700,8,2300,700,8,{"$f":"6.5*AF25","v":65},null,null,null,null,null,null,null,null,{"$f":"0.4*AE25","v":4},10,10,{"$f":"0.4*AH25","v":4},10,{"$f":"0.4*AJ25","v":4},10,null,null,"D",null,null,"Cannot be accepted with E"]
[105.01800000000009,"Reject",4,"BESS HoldCo 2 Ltd","DBESS-22","DNO connection","Battery","2019-03-31","2021-03-31","31.03.19 - 31.03.21 (24 months)","As per FFR framework agreement ",2300,2300,24,2300,2300,24,2300,2300,24,{"$f":"(6.5/2+6/2)*AF26","v":62.5},null,null,null,null,null,null,null,null,{"$f":"0.4*AE26","v":4},10,10,{"$f":"0.4*AH26","v":4},10,{"$f":"0.4*AJ26","v":4},10,null,null,"E",null,null,"Cannot accepted with A,B,C or D"]
[105.01900000000009,"Reject",1.3,"Bolshan Renewables Limited","BRLR-1","DNO connection","DSF: Storage (for export)","2019-09-30","2021-03-31","30.09.19 - 31.03.21 (18 months)","As per FFR framework agreement ",2300,2300,24,2300,2300,24,2300,2300,24,203,0,null,null,null,null,null,null,null,5.6,14,14,5.6,14,5.6,14]
[105.0200000000001,"Reject",4,"Buxton Power Limited","BPLFFR-1","DNO connection","Diesel","2018-09-30","2018-12-31","30.09.18 - 31.12.18 (3 months)","As per FFR framework agreement ",2300,1500,16,2300,1500,16,2300,1500,16,25.6,null,null,null,null,null,null,null,null,null,null,null,null,null,null,null,null,null,null,0,16]
[105.0210000000001,"Accepted","N/A","Buxton Power Limited","BPLFFR-1","DNO connection","Diesel","2018-09-30","2018-10-31","30.09.18 - 31.10.18 (1 months)","As per FFR framework agreement ",2300,2300,24,2300,2300,24,2300,2300,24,24,null,null,null,null,null,null,null,null,null,null,null,null,null,null,null,null,null,null,0,16]
[105.02200000000011,"Reject",1.3,"Centrica Brigg Ltd","ROOSB-1","DNO connection","Battery","2019-03-31","2019-09-30","31.03.19 - 30.09.19 (6 months)","As per FFR framework agreement ",2300,700,null,2300,700,8,2300,700,8,269.27999999999997,0,0,null,"Yes",null,null,null,null,17.600000000000001,44,44,17.600000000000001,44,0,0,"n/a","n/a",null,null,null,"Part load point, MEL and SEL are n/a here"]
{"$rows_left_out":389}
{"sheet":"Auto","index":1,"n_rows":11,"n_cols":2,"rows_kept":11,"cut":false,"hidden":true,"merged":[]}
["Path to the Tenders Folder","S:\\OandT\\EBandET\\Contracts\\Services & Projects\\Firm Frequency Response Service\\FFR spreadshhet test\\Ariba Received"]
["Tender Round",97]
[]
[]
[]
[]
[]
[]
[]
[]
[null," "]

{"sheet":"Calendar","index":2,"n_rows":40,"n_cols":38,"rows_kept":40,"cut":false,"hidden":true,"merged":[]}
["May-18","Jun-18","Jul-18","Aug-18","Sep-18","Oct-18","Nov-18","Dec-18","Jan-19","Feb-19","Mar-19","Apr-19","May-19","Jun-19","Jul-19","Aug-19","Sep-19","Oct-19","Nov-19","Dec-19","Jan-20","Feb-20","Mar-20","Apr-20","May-20","Jun-20","Jul-20","Aug-20","Sep-20","Oct-20","Nov-20","Dec-20","Jan-21","Feb-21","Mar-21","Apr-21","May-21","Jun-21"]
[101,102,103,104,105,106,107,108,109,110,111,112,113,114,115,116,117,118,119,120,121,122,123,124,125,126,127,128,129,130,131,132,133,134,135,136,137,138]
["2018-06-01","2018-07-01","2018-08-01","2018-09-01","2018-10-01","2018-11-01","2018-12-01","2019-01-01","2019-02-01","2019-03-01","2019-04-01","2019-05-01","2019-06-01","2019-07-01","2019-08-01","2019-09-01","2019-10-01","2019-11-01","2019-12-01","2020-01-01","2020-02-01","2020-03-01","2020-04-01","2020-05-01","2020-06-01","2020-07-01","2020-08-01","2020-09-01","2020-10-01","2020-11-01","2020-12-01","2021-01-01","2021-02-01","2021-03-01","2021-04-01","2021-05-01","2021-06-01","2021-07-01"]
[null,"2018-07-01",null,null,"2018-10-01",null,null,"2019-01-01",null,null,"2019-04-01",null,null,"2019-07-01",null,null,"2019-10-01",null,null,"2020-01-01",null,null,"2020-04-01",null,null,"2020-07-01",null,null,"2020-10-01",null,null,"2021-01-01",null,null,"2021-04-01",null,null,"2021-07-01"]
[null,"2018-08-01",null,null,"2018-11-01",null,null,"2019-02-01",null,null,"2019-05-01",null,null,"2019-08-01",null,null,"2019-11-01",null,null,"2020-02-01",null,null,"2020-05-01",null,null,"2020-08-01",null,null,"2020-11-01",null,null,"2021-02-01",null,null,"2021-05-01",null,null,"2021-08-01"]
[null,"2018-09-01",null,null,"2018-12-01",null,null,"2019-03-01",null,null,"2019-06-01",null,null,"2019-09-01",null,null,"2019-12-01",null,null,"2020-03-01",null,null,"2020-06-01",null,null,"2020-09-01",null,null,"2020-12-01",null,null,"2021-03-01",null,null,"2021-06-01",null,null,"2021-09-01"]
[null,"2018-10-01",null,null,"2018-10-01",null,null,"2019-04-01",null,null,"2019-04-01",null,null,"2019-10-01",null,null,"2019-10-01",null,null,"2020-04-01",null,null,"2020-04-01",null,null,"2020-10-01",null,null,"2020-10-01",null,null,"2021-04-01",null,null,"2021-04-01",null,null,"2021-10-01"]
[null,"2018-11-01",null,null,"2018-11-01",null,null,"2019-05-01",null,null,"2019-05-01",null,null,"2019-11-01",null,null,"2019-11-01",null,null,"2020-05-01",null,null,"2020-05-01",null,null,"2020-11-01",null,null,"2020-11-01",null,null,"2021-05-01",null,null,"2021-05-01",null,null,"2021-11-01"]
[null,"2018-12-01",null,null,"2018-12-01",null,null,"2019-06-01",null,null,"2019-06-01",null,null,"2019-12-01",null,null,"2019-12-01",null,null,"2020-06-01",null,null,"2020-06-01",null,null,"2020-12-01",null,null,"2020-12-01",null,null,"2021-06-01",null,null,"2021-06-01",null,null,"2021-12-01"]
[null,"2019-01-01",null,null,"2019-01-01",null,null,"2019-07-01",null,null,"2019-07-01",null,null,"2020-01-01",null,null,"2020-01-01",null,null,"2020-07-01",null,null,"2020-07-01",null,null,"2021-01-01",null,null,"2021-01-01",null,null,"2021-07-01",null,null,"2021-07-01",null,null,"2022-01-01"]
[null,"2019-02-01",null,null,"2019-02-01",null,null,"2019-08-01",null,null,"2019-08-01",null,null,"2020-02-01",null,null,"2020-02-01",null,null,"2020-08-01",null,null,"2020-08-01",null,null,"2021-02-01",null,null,"2021-02-01",null,null,"2021-08-01",null,null,"2021-08-01",null,null,"2022-02-01"]
[null,"2019-03-01",null,null,"2019-03-01",null,null,"2019-09-01",null,null,"2019-09-01",null,null,"2020-03-01",null,null,"2020-03-01",null,null,"2020-09-01",null,null,"2020-09-01",null,null,"2021-03-01",null,null,"2021-03-01",null,null,"2021-09-01",null,null,"2021-09-01",null,null,"2022-03-01"]
[null,"2019-04-01",null,null,"2019-04-01",null,null,"2019-10-01",null,null,"2019-10-01",null,null,"2020-04-01",null,null,"2020-04-01",null,null,"2020-10-01",null,null,"2020-10-01",null,null,"2021-04-01",null,null,"2021-04-01",null,null,"2021-10-01",null,null,"2021-10-01",null,null,"2022-04-01"]
[null,"2019-05-01",null,null,"2019-05-01",null,null,"2019-11-01",null,null,"2019-11-01",null,null,"2020-05-01",null,null,"2020-05-01",null,null,"2020-11-01",null,null,"2020-11-01",null,null,"2021-05-01",null,null,"2021-05-01",null,null,"2021-11-01",null,null,"2021-11-01",null,null,"2022-05-01"]
[null,"2019-06-01",null,null,"2019-06-01",null,null,"2019-12-01",null,null,"2019-12-01",null,null,"2020-06-01",null,null,"2020-06-01",null,null,"2020-12-01",null,null,"2020-12-01",null,null,"2021-06-01",null,null,"2021-06-01",null,null,"2021-12-01",null,null,"2021-12-01",null,null,"2022-06-01"]
[null,"2019-07-01",null,null,"2019-07-01",null,null,"2020-01-01",null,null,"2020-01-01",null,null,"2020-07-01",null,null,"2020-07-01",null,null,"2021-01-01",null,null,"2021-01-01",null,null,"2021-07-01",null,null,"2021-07-01",null,null,"2022-01-01",null,null,"2022-01-01",null,null,"2022-07-01"]
[null,"2019-08-01",null,null,"2019-08-01",null,null,"2020-02-01",null,null,"2020-02-01",null,null,"2020-08-01",null,null,"2020-08-01",null,null,"2021-02-01",null,null,"2021-02-01",null,null,"2021-08-01",null,null,"2021-08-01",null,null,"2022-02-01",null,null,"2022-02-01",null,null,"2022-08-01"]
[null,"2019-09-01",null,null,"2019-09-01",null,null,"2020-03-01",null,null,"2020-03-01",null,null,"2020-09-01",null,null,"2020-09-01",null,null,"2021-03-01",null,null,"2021-03-01",null,null,"2021-09-01",null,null,"2021-09-01",null,null,"2022-03-01",null,null,"2022-03-01",null,null,"2022-09-01"]
[null,"2019-10-01",null,null,"2019-10-01",null,null,"2020-04-01",null,null,"2020-04-01",null,null,"2020-10-01",null,null,"2020-10-01",null,null,"2021-04-01",null,null,"2021-04-01",null,null,"2021-10-01",null,null,"2021-10-01",null,null,"2022-04-01",null,null,"2022-04-01",null,null,"2022-10-01"]
[null,"2019-11-01",null,null,"2019-11-01",null,null,"2020-05-01",null,null,"2020-05-01",null,null,"2020-11-01",null,null,"2020-11-01",null,null,"2021-05-01",null,null,"2021-05-01",null,null,"2021-11-01",null,null,"2021-11-01",null,null,"2022-05-01",null,null,"2022-05-01",null,null,"2022-11-01"]
[null,"2019-12-01",null,null,"2019-12-01",null,null,"2020-06-01",null,null,"2020-06-01",null,null,"2020-12-01",null,null,"2020-12-01",null,null,"2021-06-01",null,null,"2021-06-01",null,null,"2021-12-01",null,null,"2021-12-01",null,null,"2022-06-01",null,null,"2022-06-01",null,null,"2022-12-01"]
[null,"2020-01-01",null,null,"2020-01-01",null,null,"2020-07-01",null,null,"2020-07-01",null,null,"2021-01-01",null,null,"2021-01-01",null,null,"2021-07-01",null,null,"2021-07-01",null,null,"2022-01-01",null,null,"2022-01-01",null,null,"2022-07-01",null,null,"2022-07-01",null,null,"2023-01-01"]
[null,"2020-02-01",null,null,"2020-02-01",null,null,"2020-08-01",null,null,"2020-08-01",null,null,"2021-02-01",null,null,"2021-02-01",null,null,"2021-08-01",null,null,"2021-08-01",null,null,"2022-02-01",null,null,"2022-02-01",null,null,"2022-08-01",null,null,"2022-08-01",null,null,"2023-02-01"]
[null,"2020-03-01",null,null,"2020-03-01",null,null,"2020-09-01",null,null,"2020-09-01",null,null,"2021-03-01",null,null,"2021-03-01",null,null,"2021-09-01",null,null,"2021-09-01",null,null,"2022-03-01",null,null,"2022-03-01",null,null,"2022-09-01",null,null,"2022-09-01",null,null,"2023-03-01"]
[null,"2020-04-01",null,null,"2020-04-01",null,null,"2020-10-01",null,null,"2020-10-01",null,null,"2021-04-01",null,null,"2021-04-01",null,null,"2021-10-01",null,null,"2021-10-01",null,null,"2022-04-01",null,null,"2022-04-01",null,null,"2022-10-01",null,null,"2022-10-01",null,null,"2023-04-01"]
[null,"2020-05-01",null,null,"2020-05-01",null,null,"2020-11-01",null,null,"2020-11-01",null,null,"2021-05-01",null,null,"2021-05-01",null,null,"2021-11-01",null,null,"2021-11-01",null,null,"2022-05-01",null,null,"2022-05-01",null,null,"2022-11-01",null,null,"2022-11-01",null,null,"2023-05-01"]
[null,"2020-06-01",null,null,"2020-06-01",null,null,"2020-12-01",null,null,"2020-12-01",null,null,"2021-06-01",null,null,"2021-06-01",null,null,"2021-12-01",null,null,"2021-12-01",null,null,"2022-06-01",null,null,"2022-06-01",null,null,"2022-12-01",null,null,"2022-12-01",null,null,"2023-06-01"]
[null,"2020-07-01",null,null,"2020-07-01",null,null,"2021-01-01",null,null,"2021-01-01",null,null,"2021-07-01",null,null,"2021-07-01",null,null,"2022-01-01",null,null,"2022-01-01",null,null,"2022-07-01",null,null,"2022-07-01",null,null,"2023-01-01",null,null,"2023-01-01",null,null,"2023-07-01"]
[null,"2020-08-01",null,null,"2020-08-01",null,null,"2021-02-01",null,null,"2021-02-01",null,null,"2021-08-01",null,null,"2021-08-01",null,null,"2022-02-01",null,null,"2022-02-01",null,null,"2022-08-01",null,null,"2022-08-01",null,null,"2023-02-01",null,null,"2023-02-01",null,null,"2023-08-01"]
[null,"2020-09-01",null,null,"2020-09-01",null,null,"2021-03-01",null,null,"2021-03-01",null,null,"2021-09-01",null,null,"2021-09-01",null,null,"2022-03-01",null,null,"2022-03-01",null,null,"2022-09-01",null,null,"2022-09-01",null,null,"2023-03-01",null,null,"2023-03-01",null,null,"2023-09-01"]
{"$rows_left_out":11}
{"sheet":"Drop down boxes","index":3,"n_rows":23,"n_cols":15,"rows_kept":23,"cut":false,"hidden":true,"merged":[]}
[null,"Today's date",null,"Start dates","End dates",null,null,"TO connection",null,"Gas",null,"DSF: Load response"]
["TODAY:",{"$f":"TODAY()","v":"2018-09-18"},null,{"$f":"IF(DAY(B2)<7,EOMONTH(B2, 0),EOMONTH(B2,1))","v":"2018-10-31"},{"$f":"IF(DAY(B2)<7, EOMONTH(B2,1), EOMONTH(B2,2))","v":"2018-11-30"},null,null,"DNO connection",null,"Hydro",null,"DSF: Distributed generation (onsite)",null,2300,2300]
[null,null,null,{"$f":"IF(DAY(B2)<7, EOMONTH(B2,0)+1, EOMONTH(B2,1)+1)","v":"2018-11-01"},null,null,null,null,null,"Diesel",null,"DSF: Storage (onsite)",null,300]
[null,null,null,null,null,null,null,null,null,"Bio Fuel",null,"DSF: Distributed generation (for export)",null,700]
[null,null,null,null,null,null,null,null,null,"Coal",null,"DSF: Storage (for export)",null,1100]
[null,null,null,null,null,null,null,null,null,"Wind",null,"Multiple Fuel Type",null,1500]
[null,null,null,null,null,null,null,null,null,"Solar",null,null,null,1900]
[null,null,null,null,null,null,null,null,null,"Battery"]
[null,null,null,null,null,null,null,null,null,"Interconnector"]
[null,null,null,null,null,null,null,null,null,"Dual Fuel"]
[null,null,null,null,null,null,null,null,null,"Other"]
[]
[]
[]
[]
[]
[]
[]
[]
[]
[]
[]
[null,null,null,null,null,null,{"$f":"IF($D$7=\"TO connection\",'Drop down boxes'!$J$1:$J$11,IF($D$7=\"DNO connection\",'Drop down boxes'!$L$1:$L$6,\"\"))","v":""}]