{"text_format":"1","workbook":"xlsx","n_sheets":5,"sheets":["Inputs","Report","Data","Constants","Version Control"],"not_rendered":{"charts":0,"images":0,"macros":1,"external_links":1,"defined_names":89,"comments":0,"pivot_tables":0},"unopened":[],"bounds":{"document_bytes":16777216,"sheet_cells":100000,"rows_first":2000,"rows_last":500,"rows_between":2000,"halvings":0,"cell_chars":16384,"cell_head_chars":4096},"cells_cut":0,"cells_raw":0,"read":"whole","date_system":"1900"}

{"sheet":"Inputs","index":0,"n_rows":50,"n_cols":8,"rows_kept":50,"cut":false,"hidden":false,"merged":[]}
[null,"BSUoS Report:"]
[]
[null,"Input Dates","Date"]
[null,"Report Date","2018-08-09"]
[null,"Input Data From","2018-07-09"]
[null,"Input Data To","2018-08-12"]
[]
[null,"Step","Macro","Complete?"]
[null,"Set-up spreadsheet",null,"Y"]
[null,"Import Demand Data",null,"Y"]
[null,"Import Cost Data",null,"Y"]
[null,"Export Report",null,"N"]
[null,"Save & close",null,"N"]
[]
[null,"Date","Initial\nForecast","-"]
[null,{"$f":"Input_Data_To","v":"2018-08-12"},{"$f":"(VLOOKUP(B16,Data!A$2:E$2863,4,))/2","v":2.5622244848269875}]
[null,{"$f":"IF(B16-1<Input_Data_From,\"\",B16-1)","v":"2018-08-11"},{"$f":"(VLOOKUP(B17,Data!A$2:E$2863,4,))/2","v":2.5126842215545913}]
[null,"2018-08-10",{"$f":"(VLOOKUP(B18,Data!A$2:E$2863,4,))/2","v":2.282615371287871},null,null,null,null," "]
[null,"2018-08-09",{"$f":"(VLOOKUP(B19,Data!A$2:E$2863,4,))/2","v":2.1563700282843903}]
[null,"2018-08-08",{"$f":"(VLOOKUP(B20,Data!A$2:E$2863,4,))/2","v":0.98844677420432825}]
[null,"2018-08-07",{"$f":"(VLOOKUP(B21,Data!A$2:E$2863,4,))/2","v":1.2258914376791086}]
[null,"2018-08-06",{"$f":"(VLOOKUP(B22,Data!A$2:E$2863,4,))/2","v":1.0214469464676814}]
[null,"2018-08-05",{"$f":"(VLOOKUP(B23,Data!A$2:E$2863,4,))/2","v":1.2523040664053247}]
[null,"2018-08-04",{"$f":"(VLOOKUP(B24,Data!A$2:E$2863,4,))/2","v":1.3336327778406745}]
[null,"2018-08-03",{"$f":"(VLOOKUP(B25,Data!A$2:E$2863,4,))/2","v":1.0242450093814259}]
[null,"2018-08-02",{"$f":"(VLOOKUP(B26,Data!A$2:E$2863,4,))/2","v":1.9566136804234908}]
[null,"2018-08-01",{"$f":"(VLOOKUP(B27,Data!A$2:E$2863,4,))/2","v":3.4388890725817589}]
[null,"2018-07-31",{"$f":"(VLOOKUP(B28,Data!A$2:E$2863,4,))/2","v":4.7429588111441516}]
[null,"2018-07-30",{"$f":"(VLOOKUP(B29,Data!A$2:E$2863,4,))/2","v":2.3202548493985566}]
[null,"2018-07-29",{"$f":"(VLOOKUP(B30,Data!A$2:E$2863,4,))/2","v":8.2243322034134909}]
[null,"2018-07-28",{"$f":"(VLOOKUP(B31,Data!A$2:E$2863,4,))/2","v":9.3028923341035465}]
[null,"2018-07-27",{"$f":"(VLOOKUP(B32,Data!A$2:E$2863,4,))/2","v":1.5518587913629664}]
[null,"2018-07-26",{"$f":"(VLOOKUP(B33,Data!A$2:E$2863,4,))/2","v":2.1558807844243035}]
[null,"2018-07-25",{"$f":"(VLOOKUP(B34,Data!A$2:E$2863,4,))/2","v":0.86828508210512678}]
[null,"2018-07-24",{"$f":"(VLOOKUP(B35,Data!A$2:E$2863,4,))/2","v":0.76010669295208266}]
[null,"2018-07-23",{"$f":"(VLOOKUP(B36,Data!A$2:E$2863,4,))/2","v":1.3008895928197086}]
[null,"2018-07-22",{"$f":"(VLOOKUP(B37,Data!A$2:E$2863,4,))/2","v":1.5789267843313592}]
[null,"2018-07-21",{"$f":"(VLOOKUP(B38,Data!A$2:E$2863,4,))/2","v":1.1209389651146537}]
[null,"2018-07-20",{"$f":"(VLOOKUP(B39,Data!A$2:E$2863,4,))/2","v":0.85039232197816539}]
[null,"2018-07-19",{"$f":"(VLOOKUP(B40,Data!A$2:E$2863,4,))/2","v":0.94216341985697616}]
[null,"2018-07-18",{"$f":"(VLOOKUP(B41,Data!A$2:E$2863,4,))/2","v":0.97985868381710772}]
[null,"2018-07-17",{"$f":"(VLOOKUP(B42,Data!A$2:E$2863,4,))/2","v":1.469640868816328}]
[null,"2018-07-16",{"$f":"(VLOOKUP(B43,Data!A$2:E$2863,4,))/2","v":1.5067432604772188}]
[null,"2018-07-15",{"$f":"(VLOOKUP(B44,Data!A$2:E$2863,4,))/2","v":2.313630152204226}]
[null,"2018-07-14",{"$f":"(VLOOKUP(B45,Data!A$2:E$2863,4,))/2","v":1.5966599033147786}]
[null,"2018-07-13",{"$f":"(VLOOKUP(B46,Data!A$2:E$2863,4,))/2","v":1.4115506761139507}]
[null,"2018-07-12",{"$f":"(VLOOKUP(B47,Data!A$2:E$2863,4,))/2","v":1.0851103358237566}]
[null,"2018-07-11",{"$f":"(VLOOKUP(B48,Data!A$2:E$2863,4,))/2","v":0.91177250422892897}]
[null,"2018-07-10",{"$f":"(VLOOKUP(B49,Data!A$2:E$2863,4,))/2","v":1.3123398550686047}]
[null,"2018-07-09",{"$f":"(VLOOKUP(B50,Data!A$2:E$2863,4,))/2","v":1.2413786322514673}]

{"sheet":"Report","index":1,"n_rows":52,"n_cols":6,"rows_kept":52,"cut":false,"hidden":false,"merged":[[51,1,51,5],[8,1,8,5],[47,2,47,4],[48,2,48,4]]}
[]
[null,"Daily BSUoS Forecast",null,null,null,"nationalgrid"]
[]
[]
[]
[null,null,null,null,null,{"$f":"Report_Date","v":"2018-08-09"}]
[]
[]
[null,"This report contains National Grid's day-ahead forecasts of per-MWh BSUoS costs (Balancing Services Use of System, as defined in the CUSC). A forecast at monthly resolution reaching to the end of the current financial year can be found in the MBSS (Monthly Balancing Services Statement). Model adjusted 23/08/17."]
[]
[null,"Date","Initial\nForecast"]
[null,{"$f":"Input_Data_To","v":"2018-08-12"},{"$f":"(VLOOKUP(B12,Data!A$2:E$2863,4,))/2","v":2.5622244848269875}]
[null,{"$f":"IF(B12-1<Input_Data_From,\"\",B12-1)","v":"2018-08-11"},{"$f":"(VLOOKUP(B13,Data!A$2:E$2863,4,))/2","v":2.5126842215545913}]
[null,"2018-08-10",{"$f":"(VLOOKUP(B14,Data!A$2:E$2863,4,))/2","v":2.282615371287871}]
[null,"2018-08-09",{"$f":"(VLOOKUP(B15,Data!A$2:E$2863,4,))/2","v":2.1563700282843903}]
[null,"2018-08-08",{"$f":"(VLOOKUP(B16,Data!A$2:E$2863,4,))/2","v":0.98844677420432825}]
[null,"2018-08-07",{"$f":"(VLOOKUP(B17,Data!A$2:E$2863,4,))/2","v":1.2258914376791086}]
[null,"2018-08-06",{"$f":"(VLOOKUP(B18,Data!A$2:E$2863,4,))/2","v":1.0214469464676814}]
[null,"2018-08-05",{"$f":"(VLOOKUP(B19,Data!A$2:E$2863,4,))/2","v":1.2523040664053247}]
[null,"2018-08-04",{"$f":"(VLOOKUP(B20,Data!A$2:E$2863,4,))/2","v":1.3336327778406745}]
[null,"2018-08-03",{"$f":"(VLOOKUP(B21,Data!A$2:E$2863,4,))/2","v":1.0242450093814259}]
[null,"2018-08-02",{"$f":"(VLOOKUP(B22,Data!A$2:E$2863,4,))/2","v":1.9566136804234908}]
[null,"2018-08-01",{"$f":"(VLOOKUP(B23,Data!A$2:E$2863,4,))/2","v":3.4388890725817589}]
[null,"2018-07-31",{"$f":"(VLOOKUP(B24,Data!A$2:E$2863,4,))/2","v":4.7429588111441516}]
[null,"2018-07-30",{"$f":"(VLOOKUP(B25,Data!A$2:E$2863,4,))/2","v":2.3202548493985566}]
[null,"2018-07-29",{"$f":"(VLOOKUP(B26,Data!A$2:E$2863,4,))/2","v":8.2243322034134909}]
[null,"2018-07-28",{"$f":"(VLOOKUP(B27,Data!A$2:E$2863,4,))/2","v":9.3028923341035465}]
[null,"2018-07-27",{"$f":"(VLOOKUP(B28,Data!A$2:E$2863,4,))/2","v":1.5518587913629664}]
[null,"2018-07-26",{"$f":"(VLOOKUP(B29,Data!A$2:E$2863,4,))/2","v":2.1558807844243035}]
[null,"2018-07-25",{"$f":"(VLOOKUP(B30,Data!A$2:E$2863,4,))/2","v":0.86828508210512678}]
[null,"2018-07-24",{"$f":"(VLOOKUP(B31,Data!A$2:E$2863,4,))/2","v":0.76010669295208266}]
[null,"2018-07-23",{"$f":"(VLOOKUP(B32,Data!A$2:E$2863,4,))/2","v":1.3008895928197086}]
[null,"2018-07-22",{"$f":"(VLOOKUP(B33,Data!A$2:E$2863,4,))/2","v":1.5789267843313592}]
[null,"2018-07-21",{"$f":"(VLOOKUP(B34,Data!A$2:E$2863,4,))/2","v":1.1209389651146537}]
[null,"2018-07-20",{"$f":"(VLOOKUP(B35,Data!A$2:E$2863,4,))/2","v":0.85039232197816539}]
[null,"2018-07-19",{"$f":"(VLOOKUP(B36,Data!A$2:E$2863,4,))/2","v":0.94216341985697616}]
[null,"2018-07-18",{"$f":"(VLOOKUP(B37,Data!A$2:E$2863,4,))/2","v":0.97985868381710772}]
[null,"2018-07-17",{"$f":"(VLOOKUP(B38,Data!A$2:E$2863,4,))/2","v":1.469640868816328}]
[null,"2018-07-16",{"$f":"(VLOOKUP(B39,Data!A$2:E$2863,4,))/2","v":1.5067432604772188}]
[null,"2018-07-15",{"$f":"(VLOOKUP(B40,Data!A$2:E$2863,4,))/2","v":2.313630152204226}]
[null,"2018-07-14",{"$f":"(VLOOKUP(B41,Data!A$2:E$2863,4,))/2","v":1.5966599033147786}]
[null,"2018-07-13",{"$f":"(VLOOKUP(B42,Data!A$2:E$2863,4,))/2","v":1.4115506761139507}]
[null,"2018-07-12",{"$f":"(VLOOKUP(B43,Data!A$2:E$2863,4,))/2","v":1.0851103358237566}]
[null,"2018-07-11",{"$f":"(VLOOKUP(B44,Data!A$2:E$2863,4,))/2","v":0.91177250422892897}]
[null,"2018-07-10",{"$f":"(VLOOKUP(B45,Data!A$2:E$2863,4,))/2","v":1.3123398550686047}]
[null,"2018-07-09",{"$f":"(VLOOKUP(B46,Data!A$2:E$2863,4,))/2","v":1.2413786322514673}]
[]
[null,"CUSC","Indicative Outturn can now be found on the website under:"]
[null,"MBSS","Daily Balancing Costs (BSUoS)"]
[]
[null,"Disclaimer"]
[null,"This forecast is published without prejudice and whilst every effort has been made to ensure the accuracy of the information, it is subject to several estimations and forecasts and may not bear relation to either the indicative or actual tariffs National Grid will publish at later dates."]

{"sheet":"Data","index":2,"n_rows":1283,"n_cols":4,"rows_kept":1283,"cut":false,"hidden":false,"merged":[]}
["BSUoS data:","Forecast Demand","IBC","Forecast BSUoS"]
["2015-04-01",858337.75,{"$error":"#N/A"},{"$f":"C2*1000000/B2","v":{"$error":"#N/A"}}]
["2015-04-02",881968.41666666663,{"$error":"#N/A"},{"$f":"C3*1000000/B3","v":{"$error":"#N/A"}}]
["2015-04-03",781351.41666666663,{"$error":"#N/A"},{"$error":"#N/A"}]
["2015-04-04",735119.58333333337,{"$error":"#N/A"},{"$error":"#N/A"}]
["2015-04-05",710810.25,{"$error":"#N/A"},{"$error":"#N/A"}]
["2015-04-06",728617.66666666663,{"$error":"#N/A"},{"$error":"#N/A"}]
["2015-04-07",834689.58333333337,{"$error":"#N/A"},{"$error":"#N/A"}]
["2015-04-08",847339.16666666663,{"$error":"#N/A"},{"$error":"#N/A"}]
["2015-04-09",852126.83333333337,{"$error":"#N/A"},{"$error":"#N/A"}]
["2015-04-10",838750.25,{"$error":"#N/A"},{"$error":"#N/A"}]
["2015-04-11",735119.58333333337,{"$error":"#N/A"},{"$error":"#N/A"}]
["2015-04-12",710810.25,{"$error":"#N/A"},{"$error":"#N/A"}]
["2015-04-13",728617.66666666663,{"$error":"#N/A"},{"$error":"#N/A"}]
["2015-04-14",834689.58333333337,{"$error":"#N/A"},{"$error":"#N/A"}]
["2015-04-15",847339.16666666663,{"$error":"#N/A"},{"$error":"#N/A"}]
["2015-04-16",852126.83333333337,{"$error":"#N/A"},{"$error":"#N/A"}]
["2015-04-17",838750.25,{"$error":"#N/A"},{"$error":"#N/A"}]
["2015-04-18",735119.58333333337,{"$error":"#N/A"},{"$error":"#N/A"}]
["2015-04-19",710810.25,{"$error":"#N/A"},{"$error":"#N/A"}]
["2015-04-20",808452.25,{"$error":"#N/A"},{"$error":"#N/A"}]
["2015-04-21",815808.25,{"$error":"#N/A"},{"$error":"#N/A"}]
["2015-04-22",817100.58333333337,{"$error":"#N/A"},{"$error":"#N/A"}]
["2015-04-23",815186.91666666663,{"$error":"#N/A"},{"$error":"#N/A"}]
["2015-04-24",798538.58333333337,{"$error":"#N/A"},{"$error":"#N/A"}]
["2015-04-25",708715,{"$error":"#N/A"},{"$error":"#N/A"}]
["2015-04-26",684561.58333333337,{"$error":"#N/A"},{"$error":"#N/A"}]
["2015-04-27",807037.33333333337,{"$error":"#N/A"},{"$error":"#N/A"}]
["2015-04-28",814777.75,{"$error":"#N/A"},{"$error":"#N/A"}]
["2015-04-29",790886.83333333337,{"$error":"#N/A"},{"$error":"#N/A"}]
["2015-04-30",769569.91666666663,{"$error":"#N/A"},{"$error":"#N/A"}]
["2015-05-01",767444.58333333337,{"$error":"#N/A"},{"$error":"#N/A"}]
["2015-05-02",688544.66666666663,{"$error":"#N/A"},{"$error":"#N/A"}]
["2015-05-03",650859.5,{"$error":"#N/A"},{"$error":"#N/A"}]
["2015-05-04",681252.58333333337,{"$error":"#N/A"},{"$error":"#N/A"}]
["2015-05-05",730812.66666666663,{"$error":"#N/A"},{"$error":"#N/A"}]
["2015-05-06",743468.41666666663,{"$error":"#N/A"},{"$error":"#N/A"}]
["2015-05-07",752812.08333333337,{"$error":"#N/A"},{"$error":"#N/A"}]
["2015-05-08",756564,{"$error":"#N/A"},{"$error":"#N/A"}]
["2015-05-09",655351.66666666663,{"$error":"#N/A"},{"$error":"#N/A"}]
["2015-05-10",652669.41666666663,{"$error":"#N/A"},{"$error":"#N/A"}]
["2015-05-11",697038.91666666663,{"$error":"#N/A"},{"$error":"#N/A"}]
["2015-05-12",756742.83333333337,{"$error":"#N/A"},{"$error":"#N/A"}]
["2015-05-13",736731.33333333337,{"$error":"#N/A"},{"$error":"#N/A"}]
["2015-05-14",788620,{"$error":"#N/A"},{"$error":"#N/A"}]
["2015-05-15",773853.16666666663,{"$error":"#N/A"},{"$error":"#N/A"}]
["2015-05-16",657653.25,{"$error":"#N/A"},{"$error":"#N/A"}]
["2015-05-17",652669.41666666663,{"$error":"#N/A"},{"$error":"#N/A"}]
["2015-05-18",697038.91666666663,{"$error":"#N/A"},{"$error":"#N/A"}]
["2015-05-19",755558.08333333337,{"$error":"#N/A"},{"$error":"#N/A"}]
["2015-05-20",744412.91666666663,{"$error":"#N/A"},{"$error":"#N/A"}]
["2015-05-21",739555.25,{"$error":"#N/A"},{"$error":"#N/A"}]
["2015-05-22",733356.91666666663,{"$error":"#N/A"},{"$error":"#N/A"}]
["2015-05-23",643995.66666666663,{"$error":"#N/A"},{"$error":"#N/A"}]
["2015-05-24",616505.75,{"$error":"#N/A"},{"$error":"#N/A"}]
["2015-05-25",697038.91666666663,{"$error":"#N/A"},{"$error":"#N/A"}]
["2015-05-26",755558.08333333337,{"$error":"#N/A"},{"$error":"#N/A"}]
["2015-05-27",744412.91666666663,{"$error":"#N/A"},{"$error":"#N/A"}]
["2015-05-28",730423.25,{"$error":"#N/A"},{"$error":"#N/A"}]
["2015-05-29",728557,{"$error":"#N/A"},{"$error":"#N/A"}]
["2015-05-30",630243.66666666663,{"$error":"#N/A"},{"$error":"#N/A"}]
["2015-05-31",614851.91666666663,{"$error":"#N/A"},{"$error":"#N/A"}]
["2015-06-01",722729.66666666663,{"$error":"#N/A"},{"$error":"#N/A"}]
["2015-06-02",700237.91666666663,{"$error":"#N/A"},{"$error":"#N/A"}]
["2015-06-03",705702,{"$error":"#N/A"},{"$error":"#N/A"}]
["2015-06-04",722844.58333333337,{"$error":"#N/A"},{"$error":"#N/A"}]
["2015-06-05",713511.41666666663,{"$error":"#N/A"},{"$f":"C67*1000000/B67","v":{"$error":"#N/A"}}]
["2015-06-06",580039.33333333337,{"$error":"#N/A"},{"$error":"#N/A"}]
["2015-06-07",593085.75,{"$error":"#N/A"},{"$error":"#N/A"}]
["2015-06-08",710402.25,{"$error":"#N/A"},{"$error":"#N/A"}]
["2015-06-09",727229.08333333337,{"$error":"#N/A"},{"$error":"#N/A"}]
["2015-06-10",713614.41666666663,{"$error":"#N/A"},{"$error":"#N/A"}]
["2015-06-11",707135.58333333337,{"$error":"#N/A"},{"$error":"#N/A"}]
["2015-06-12",716208,{"$error":"#N/A"},{"$error":"#N/A"}]
["2015-06-13",645161,{"$error":"#N/A"},{"$error":"#N/A"}]
["2015-06-14",633437.25,{"$error":"#N/A"},{"$error":"#N/A"}]
["2015-06-15",741983.16666666663,{"$error":"#N/A"},{"$error":"#N/A"}]
["2015-06-16",726455.33333333337,{"$error":"#N/A"},{"$error":"#N/A"}]
["2015-06-17",715291.33333333337,{"$error":"#N/A"},{"$error":"#N/A"}]
["2015-06-18",689181.33333333337,{"$error":"#N/A"},{"$error":"#N/A"}]
["2015-06-19",701545.91666666663,{"$error":"#N/A"},{"$error":"#N/A"}]
["2015-06-20",648475.66666666663,{"$error":"#N/A"},{"$error":"#N/A"}]
["2015-06-21",603866,{"$error":"#N/A"},{"$error":"#N/A"}]
["2015-06-22",739485.66666666663,{"$error":"#N/A"},{"$error":"#N/A"}]
["2015-06-23",714839.08333333337,{"$error":"#N/A"},{"$error":"#N/A"}]
["2015-06-24",721495.58333333337,{"$error":"#N/A"},{"$error":"#N/A"}]
["2015-06-25",728107,{"$error":"#N/A"},{"$error":"#N/A"}]
["2015-06-26",708707.83333333337,{"$error":"#N/A"},{"$error":"#N/A"}]
["2015-06-27",601643.91666666663,{"$error":"#N/A"},{"$error":"#N/A"}]
["2015-06-28",605025.58333333337,{"$error":"#N/A"},{"$error":"#N/A"}]
["2015-06-29",715083.41666666663,{"$error":"#N/A"},{"$error":"#N/A"}]
["2015-06-30",709666.16666666663,{"$error":"#N/A"},{"$error":"#N/A"}]
["2015-07-01",738738.75,{"$error":"#N/A"},{"$error":"#N/A"}]
["2015-07-02",757026.58333333337,{"$error":"#N/A"},{"$error":"#N/A"}]
["2015-07-03",704159.33333333337,{"$error":"#N/A"},{"$error":"#N/A"}]
["2015-07-04",613587.16666666663,{"$error":"#N/A"},{"$error":"#N/A"}]
["2015-07-05",611355.83333333337,{"$error":"#N/A"},{"$error":"#N/A"}]
["2015-07-06",719396.33333333337,{"$error":"#N/A"},{"$error":"#N/A"}]
["2015-07-07",711307.41666666698,{"$error":"#N/A"},{"$error":"#N/A"}]
["2015-07-08",709731.58333333337,{"$error":"#N/A"},{"$error":"#N/A"}]
["2015-07-09",698124.08333333337,{"$error":"#N/A"},{"$error":"#N/A"}]
["2015-07-10",683574.58333333302,{"$error":"#N/A"},{"$error":"#N/A"}]
["2015-07-11",603178.33333333302,{"$error":"#N/A"},{"$error":"#N/A"}]
["2015-07-12",600729.25,{"$error":"#N/A"},{"$error":"#N/A"}]
["2015-07-13",729459.5,{"$error":"#N/A"},{"$error":"#N/A"}]
["2015-07-14",746311.91666666663,{"$error":"#N/A"},{"$error":"#N/A"}]
["2015-07-15",711305.66666666663,{"$error":"#N/A"},{"$error":"#N/A"}]
["2015-07-16",714776.58333333337,{"$error":"#N/A"},{"$error":"#N/A"}]
["2015-07-17",671484.66666666663,{"$error":"#N/A"},{"$error":"#N/A"}]
["2015-07-18",576869.91666666663,{"$error":"#N/A"},{"$error":"#N/A"}]
["2015-07-19",615952.58333333337,{"$error":"#N/A"},{"$error":"#N/A"}]
["2015-07-20",713991.91666666663,{"$error":"#N/A"},{"$error":"#N/A"}]
["2015-07-21",689583.25,{"$error":"#N/A"},{"$error":"#N/A"}]
["2015-07-22",708531.75,{"$error":"#N/A"},{"$error":"#N/A"}]
["2015-07-23",699633.5,{"$error":"#N/A"},{"$error":"#N/A"}]
["2015-07-24",740602.25,{"$error":"#N/A"},{"$error":"#N/A"}]
["2015-07-25",590932.91666666663,{"$error":"#N/A"},{"$error":"#N/A"}]
["2015-07-26",623904.41666666663,{"$error":"#N/A"},{"$error":"#N/A"}]
["2015-07-27",690432.41666666663,{"$error":"#N/A"},{"$error":"#N/A"}]
["2015-07-28",697373.66666666663,{"$error":"#N/A"},{"$error":"#N/A"}]
["2015-07-29",716456.91666666663,{"$error":"#N/A"},{"$error":"#N/A"}]
["2015-07-30",696664.08333333337,{"$error":"#N/A"},{"$error":"#N/A"}]
["2015-07-31",672210.5,{"$error":"#N/A"},{"$error":"#N/A"}]
["2015-08-01",602805.83333333337,{"$error":"#N/A"},{"$error":"#N/A"}]
["2015-08-02",592648.08333333337,{"$error":"#N/A"},{"$error":"#N/A"}]
["2015-08-03",671375.16666666663,{"$error":"#N/A"},{"$error":"#N/A"}]
["2015-08-04",667747.83333333337,{"$error":"#N/A"},{"$error":"#N/A"}]
["2015-08-05",698828.91666666663,{"$error":"#N/A"},{"$error":"#N/A"}]
["2015-08-06",689826.66666666663,{"$error":"#N/A"},{"$error":"#N/A"}]
["2015-08-07",678920.41666666663,{"$error":"#N/A"},{"$error":"#N/A"}]
["2015-08-08",578867.58333333337,{"$error":"#N/A"},{"$f":"C131*1000000/B131","v":{"$error":"#N/A"}}]
["2015-08-09",591873.91666666663,{"$error":"#N/A"},{"$error":"#N/A"}]
["2015-08-10",706068,{"$error":"#N/A"},{"$error":"#N/A"}]
["2015-08-11",703866.25,{"$error":"#N/A"},{"$error":"#N/A"}]
["2015-08-12",700114.58333333291,{"$error":"#N/A"},{"$error":"#N/A"}]
["2015-08-13",729985.5,{"$error":"#N/A"},{"$error":"#N/A"}]
["2015-08-14",721262.41666666698,{"$error":"#N/A"},{"$error":"#N/A"}]
["2015-08-15",611413.16666666698,{"$error":"#N/A"},{"$error":"#N/A"}]
["2015-08-16",611912.41666666698,{"$error":"#N/A"},{"$error":"#N/A"}]
["2015-08-17",719685.16666666663,{"$error":"#N/A"},{"$error":"#N/A"}]
["2015-08-18",728608.91666666663,{"$error":"#N/A"},{"$error":"#N/A"}]
["2015-08-19",726550.16666666663,{"$error":"#N/A"},{"$error":"#N/A"}]
["2015-08-20",711995.33333333337,{"$error":"#N/A"},{"$error":"#N/A"}]
["2015-08-21",706353.41666666663,{"$error":"#N/A"},{"$error":"#N/A"}]
["2015-08-22",629162.58333333337,{"$error":"#N/A"},{"$error":"#N/A"}]
["2015-08-23",607513.33333333337,{"$error":"#N/A"},{"$error":"#N/A"}]
["2015-08-24",721010.66666666663,{"$error":"#N/A"},{"$error":"#N/A"}]
["2015-08-25",733229.83333333337,{"$error":"#N/A"},{"$error":"#N/A"}]
["2015-08-26",739110.58333333337,{"$error":"#N/A"},{"$error":"#N/A"}]
["2015-08-27",732981.41666666663,{"$error":"#N/A"},{"$error":"#N/A"}]
["2015-08-28",721352.75,{"$error":"#N/A"},{"$error":"#N/A"}]
["2015-08-29",633843.25,{"$error":"#N/A"},{"$error":"#N/A"}]
["2015-08-30",603682.58333333337,{"$error":"#N/A"},{"$error":"#N/A"}]
["2015-08-31",646080.58333333337,{"$error":"#N/A"},{"$error":"#N/A"}]
["2015-09-01",710342.08333333337,{"$error":"#N/A"},{"$error":"#N/A"}]
["2015-09-02",728624.41666666663,{"$error":"#N/A"},{"$error":"#N/A"}]
["2015-09-03",736380.33333333337,{"$error":"#N/A"},{"$error":"#N/A"}]
["2015-09-04",726801.08333333337,{"$error":"#N/A"},{"$error":"#N/A"}]
["2015-09-05",628317.91666666663,{"$error":"#N/A"},{"$error":"#N/A"}]
["2015-09-06",609093.83333333337,{"$error":"#N/A"},{"$error":"#N/A"}]
["2015-09-07",749788.58333333337,{"$error":"#N/A"},{"$error":"#N/A"}]
["2015-09-08",774964.25,{"$error":"#N/A"},{"$error":"#N/A"}]
["2015-09-09",757616.91666666663,{"$error":"#N/A"},{"$error":"#N/A"}]
["2015-09-10",722774.41666666663,{"$error":"#N/A"},{"$error":"#N/A"}]
["2015-09-11",706414.91666666663,{"$error":"#N/A"},{"$error":"#N/A"}]
["2015-09-12",633111.75,{"$error":"#N/A"},{"$error":"#N/A"}]
["2015-09-13",646094.83333333337,{"$error":"#N/A"},{"$error":"#N/A"}]
["2015-09-14",761774.58333333337,{"$error":"#N/A"},{"$error":"#N/A"}]
["2015-09-15",764784,{"$error":"#N/A"},{"$error":"#N/A"}]
["2015-09-16",778857.41666666663,{"$error":"#N/A"},{"$error":"#N/A"}]
["2015-09-17",753801.25,{"$error":"#N/A"},{"$error":"#N/A"}]
["2015-09-18",748242.91666666663,{"$error":"#N/A"},{"$error":"#N/A"}]
["2015-09-19",665247.41666666663,{"$error":"#N/A"},{"$error":"#N/A"}]
["2015-09-20",654864.83333333337,{"$error":"#N/A"},{"$error":"#N/A"}]
["2015-09-21",784235.75,{"$error":"#N/A"},{"$error":"#N/A"}]
["2015-09-22",769863,{"$error":"#N/A"},{"$error":"#N/A"}]
["2015-09-23",761708.66666666663,{"$error":"#N/A"},{"$error":"#N/A"}]
["2015-09-24",749849.75,{"$error":"#N/A"},{"$error":"#N/A"}]
["2015-09-25",731881.08333333337,{"$error":"#N/A"},{"$error":"#N/A"}]
["2015-09-26",656950.5,{"$error":"#N/A"},{"$error":"#N/A"}]
["2015-09-27",646965.75,{"$error":"#N/A"},{"$error":"#N/A"}]
["2015-09-28",746391.83333333337,{"$error":"#N/A"},{"$error":"#N/A"}]
["2015-09-29",758737.58333333337,{"$error":"#N/A"},{"$error":"#N/A"}]
["2015-09-30",752154.25,{"$error":"#N/A"},{"$error":"#N/A"}]
["2015-10-01",762549.5,{"$error":"#N/A"},{"$error":"#N/A"}]
["2015-10-02",754649.33333333337,{"$error":"#N/A"},{"$error":"#N/A"}]
["2015-10-03",692928.91666666663,{"$error":"#N/A"},{"$error":"#N/A"}]
["2015-10-04",671717.75,{"$error":"#N/A"},{"$error":"#N/A"}]
["2015-10-05",771975,{"$error":"#N/A"},{"$error":"#N/A"}]
["2015-10-06",784485.5,{"$error":"#N/A"},{"$error":"#N/A"}]
["2015-10-07",791322.33333333337,{"$error":"#N/A"},{"$error":"#N/A"}]
["2015-10-08",799331,{"$error":"#N/A"},{"$error":"#N/A"}]
["2015-10-09",782601.58333333337,{"$error":"#N/A"},{"$error":"#N/A"}]
["2015-10-10",705750.41666666663,{"$error":"#N/A"},{"$error":"#N/A"}]
["2015-10-11",682022.08333333337,{"$error":"#N/A"},{"$f":"C195*1000000/B195","v":{"$error":"#N/A"}}]
["2015-10-12",801447.16666666663,{"$error":"#N/A"},{"$error":"#N/A"}]
["2015-10-13",822785.5,{"$error":"#N/A"},{"$error":"#N/A"}]
["2015-10-14",823429.58333333337,{"$error":"#N/A"},{"$error":"#N/A"}]
["2015-10-15",831258,{"$error":"#N/A"},{"$error":"#N/A"}]
["2015-10-16",814272.58333333337,{"$error":"#N/A"},{"$error":"#N/A"}]
{"$rows_left_out":1084}
{"sheet":"Constants","index":3,"n_rows":36,"n_cols":7,"rows_kept":36,"cut":false,"hidden":false,"merged":[]}
[null,"Constants:"]
[]
[null,"Constant","Value","Comment"]
[null,null,null,null,null,null,{"$f":"IF(B4=\"\",\"\",B4&\" = Range(\"&B4&\")\")","v":""}]
[null,"internal_BSUoS_cost_per_year",164,"£, millions"]
[null,"forecast_BSIS_profit_per_year",8,"£, millions"]
[null,"black_start_contract_costs_per_day",0.123,"£, millions"]
[null,"days_per_year",365]
[null,"hours_per_SP",0.5]
[]
[null,"DA_report_dir","\\\\uk.corporg.net\\NGTDFS$\\Group\\OandT\\OptRisk\\Operational_Requirements_WOKH\\32_Electricity Incentives Development\\Performance\\ROP\\FY_1819\\Sent_To_Finance"]
[]
[null,"forecast_values_wkst",null,"Name of worksheet"]
[null,"forecast_values_date_col",null,"Date is in column XX"]
[null,"forecast_values_totals_col",null,"\"Overall\" cost for each day is in column XX"]
[]
[null,"outturn_values_wkst","Outturn_Daily","Name of worksheet"]
[null,"outturn_values_date_col",3,"Date is in column XX"]
[null,"outturn_values_totals_col",4,"\"IBC\" cost for each day is in column XX"]
[]
[null,"inputs_wkst","Inputs","Name of worksheet"]
[]
[null,"report_wkst","Report","Name of worksheet"]
[]
[null,"data_wkst","Data","Name of worksheet"]
[null,"data_date_col",1]
[null,"data_forecast_demand_col",2]
[null,"data_IBC_col",3]
[null,"data_forecast_int_col"]
[null,"data_forecast_BSIS_col"]
[null,"data_forecast_BSUoS_col",4]
[null,"data_outturn_demand_col"]
[null,"data_outturn_ext_col"]
[null,"data_outturn_int_col"]
[null,"data_outturn_BSIS_col"]
[null,"data_outturn_BSUoS_col"]

{"sheet":"Version Control","index":4,"n_rows":5,"n_cols":6,"rows_kept":5,"cut":false,"hidden":false,"merged":[]}
[null,"Version Control:"]
[]
[null,"Version","Date Implemented ","Change","Implementor","Trading Database Change & Failure Risk Register Updated "]
[null,1,"2015-05-12","Created","Robert Westmancoat","Yes"]
[null,2.1,"2017-08-23","BSUoS Internal and BSIS updated on the \"Constants\" sheet to current data, black start costs included ","Zoe Carlin","No"]