{"text_format":"1","workbook":"xlsx","n_sheets":29,"sheets":["Index","Residuals","T1","T2","T3","T4","T5","T6","T7","T8 & Fig 4","T9","T10","T10 A-Z","T11","T12","T13","T14","T15","T16","T17","T18","T20","T21","T22","T23","T24","T25","T26","T27"],"not_rendered":{"charts":2,"images":0,"macros":1,"external_links":4,"defined_names":840,"comments":0,"pivot_tables":0},"unopened":[],"bounds":{"document_bytes":16777216,"sheet_cells":100000,"rows_first":2000,"rows_last":500,"rows_between":2000,"halvings":0,"cell_chars":16384,"cell_head_chars":4096},"cells_cut":0,"cells_raw":0,"read":"whole","date_system":"1900"}

{"sheet":"Index","index":0,"n_rows":29,"n_cols":1,"rows_kept":29,"cut":false,"hidden":false,"merged":[]}
["INDEX"]
[{"$f":"Residuals!A1","v":"Residuals and Averages"}]
[{"$f":"'T1'!A1","v":"Table 1 - Summary of Demand Tariffs"}]
[{"$f":"'T2'!A1","v":"Table 2 - Demand Tariffs"}]
[{"$f":"'T3'!A1","v":"Table 3 - Change in HH Demand Tariffs"}]
[{"$f":"'T4'!A1","v":"Table 4 - Embedded Export Tariff"}]
[{"$f":"'T5'!A1","v":"Table 5 - NHH Demand Tariff Changes"}]
[{"$f":"'T6'!A1","v":"Table 6 - Changes to Average Tariffs"}]
{"$rows_left_out":22}
{"sheet":"Residuals","index":1,"n_rows":11,"n_cols":5,"rows_kept":11,"cut":false,"hidden":false,"merged":[]}
["Residuals and Averages",null,null,"Return to Index"]
[]
["Residual",{"$f":"'T6'!B3","v":"2019/20 April"},{"$f":"'T6'!C3","v":"2019/20 June"},{"$f":"'T6'!D3","v":"Change since last forecast"}]
["Generation",{"$f":"'T6'!B4","v":-3.2912402716384728},{"$f":"'T6'!C4","v":-3.6130603651697655},{"$f":"'T6'!D4","v":-0.32182009353129271}]
["Demand",{"$f":"'T1'!C5","v":50.298596000000003},{"$f":"'T1'!D5","v":51.697066},{"$f":"'T1'!E5","v":1.3984699999999961}]
[]
["Average Tariff",{"$f":"B3","v":"2019/20 April"},{"$f":"C3","v":"2019/20 June"},{"$f":"D3","v":"Change since last forecast"}]
["Generation (£/kW)",{"$f":"'T6'!B5","v":6.0208320782492519},{"$f":"'T6'!C5","v":5.6112696379735949},{"$f":"'T6'!D5","v":-0.40956244027565702}," N.B. These generation average tariffs include local tariffs"]
{"$rows_left_out":4}
{"sheet":"T1","index":2,"n_rows":13,"n_cols":5,"rows_kept":13,"cut":false,"hidden":false,"merged":[]}
["Table 1 - Summary of Demand Tariffs",null,null,null,"Return to Index"]
[]
[null,"HH Tariffs","2019/20 April","2019/20 June","Change"]
[null,"Average Tariff (£/kW)",49.346251000000002,50.745111000000001,1.3988599999999991]
[null,"Residual (£/kW)",50.298596000000003,51.697066,1.3984699999999961]
[null,"EET","2019/20 April","2019/20 June","Change"]
[null,"Average Tariff (£/kW)",14.301062,14.306876000000001,5.814000000000874E-3]
[null,"Phased residual (£/kW)",14.65,14.65,0]
{"$rows_left_out":6}
{"sheet":"T2","index":3,"n_rows":19,"n_cols":5,"rows_kept":19,"cut":false,"hidden":false,"merged":[]}
["Table 2 - Demand Tariffs",null,null,null,"Return to Index"]
[]
["Zone","Zone Name","HH Demand Tariff (£/kW)","NHH Demand Tariff (p/kWh)","Embedded Export Tariff (£/kW)"]
[1,"Northern Scotland",21.117249000000001,2.8425820000000002,0]
[2,"Southern Scotland",28.797132000000001,3.7698710000000002,0]
[3,"Northern",41.292129000000003,5.2453459999999996,7.5723310000000001]
[4,"North West",48.128953000000003,6.2402509999999998,14.409155]
[5,"Yorkshire",48.421348999999999,6.1628970000000001,14.701551]
{"$rows_left_out":12}
{"sheet":"T3","index":4,"n_rows":34,"n_cols":6,"rows_kept":34,"cut":false,"hidden":false,"merged":[]}
["Table 3 - Change in HH Demand Tariffs",null,null,null,null,"Return to Index"]
[]
["Zone","Zone Name","2019/20 April (£/kW)","2019/20 June (£/kW)","Change (£/kW)","Change in Residual (£/kW)"]
[1,"Northern Scotland",19.737006000000001,21.117249000000001,{"$f":"D4-C4","v":1.3802430000000001},1.3984697737934297]
[2,"Southern Scotland",27.418724000000001,28.797132000000001,{"$f":"D5-C5","v":1.3784080000000003},1.3984697737934297]
[3,"Northern",39.892709000000004,41.292129000000003,1.3994199999999992,1.3984697737934297]
[4,"North West",46.722382000000003,48.128953000000003,1.4065709999999996,1.3984697737934297]
[5,"Yorkshire",47.014046,48.421348999999999,1.4073029999999989,1.3984697737934297]
{"$rows_left_out":27}
{"sheet":"T4","index":5,"n_rows":34,"n_cols":6,"rows_kept":34,"cut":false,"hidden":false,"merged":[]}
["Table 4 - Embedded Export Tariff",null,null,null,"Return to Index"]
[]
[]
["Zone","Zone Name","2019/20 April (£/kW)","2019/20 June (£/kW)","Change (£/kW)"]
[1,"Northern Scotland",0,0,{"$f":"D5-C5","v":0}]
[2,"Southern Scotland",0,0,{"$f":"D6-C6","v":0}]
[3,"Northern",7.5641129999999999,7.5723310000000001,8.2180000000002806E-3]
[4,"North West",14.393786,14.409155,1.5368999999999744E-2]
{"$rows_left_out":27}
{"sheet":"T5","index":6,"n_rows":17,"n_cols":5,"rows_kept":17,"cut":false,"hidden":false,"merged":[]}
["Table 5 - NHH Demand Tariff Changes",null,null,"Return to Index"]
[]
["Zone","Zone Name","2019/20 April (p/kWh)","2019/20 June (p/kWh)","Change (p/kWh)"]
[1,"Northern Scotland",2.6567880000000001,2.8425820000000002,{"$f":"D4-C4","v":0.18579400000000001}]
[2,"Southern Scotland",3.5894219999999999,3.7698710000000002,{"$f":"D5-C5","v":0.1804490000000003}]
[3,"Northern",5.067577,5.2453459999999996,0.17776899999999962]
[4,"North West",6.0578789999999998,6.2402509999999998,0.18237199999999998]
[5,"Yorkshire",5.9837809999999996,6.1628970000000001,0.1791160000000005]
{"$rows_left_out":10}
{"sheet":"T6","index":7,"n_rows":5,"n_cols":6,"rows_kept":5,"cut":false,"hidden":false,"merged":[]}
["Table 6 - Changes to Average Tariffs",null,null,null,null,"Return to Index"]
[]
["Generation Tariffs (£/kW)","2019/20 April","2019/20 June","Change since last forecast"]
["Residual",-3.2912402716384728,-3.6130603651697655,{"$f":"C4-B4","v":-0.32182009353129271}]
["Average Generation Tariff",6.0208320782492519,5.6112696379735949,{"$f":"C5-B5","v":-0.40956244027565702},"N.B. These generation average tariffs include local tariffs"]

{"sheet":"T7","index":8,"n_rows":31,"n_cols":9,"rows_kept":31,"cut":false,"hidden":false,"merged":[[32,6,32,7],[1,6,1,8]]}
["Table 7 - Generation Wider Tariffs",null,null,null,null,null,null,null,"Return to Index"]
[null,null,null,null,null,null,"Example tariffs for a generator of each technology type:"]
[null,null,"System Peak","Shared \nYear Round","Not Shared Year Round","Residual","Conventional Carbon 80%","Conventional Low Carbon 80%","Intermittent 40%"]
["Zone","Zone Name","Tariff\n(£/kW)","Tariff\n(£/kW)","Tariff\n(£/kW)","Tariff\n(£/kW)","Tariff\n(£/kW)","Tariff\n(£/kW)","Tariff\n(£/kW)"]
[1,"North Scotland",2.6334780000000002,17.866047999999999,16.290564,-3.6130599999999999,26.345707599999997,29.6038204,19.823923199999999]
[2,"East Aberdeenshire",4.85642,10.389875999999999,16.290564,-3.6130599999999999,22.587712,25.845824799999999,16.833454399999997]
[3,"Western Highlands",2.0662050000000001,18.018719000000001,16.300922,-3.6130599999999999,25.908857800000003,29.169042199999996,19.895349599999999]
[4,"Skye and Lochalsh",-4.0508990000000002,18.018719000000001,16.185831,-3.6130599999999999,19.699680999999998,22.936847199999999,19.7802586]
{"$rows_left_out":24}
{"sheet":"T8 & Fig 4","index":9,"n_rows":35,"n_cols":12,"rows_kept":35,"cut":false,"hidden":false,"merged":[[3,0,3,11],[4,2,4,4],[4,8,4,10],[4,11,5,11],[0,0,0,10],[4,5,4,7]]}
["Table 8 - Generation Tariff Changes",null,null,null,null,null,null,null,null,null,null,"Return to Index"]
[]
[]
["Wider Generation Tariffs (£/kW)"]
[null,null,"Conventional Carbon 80%",null,null,"Conventional Low Carbon 80%",null,null,"Intermittent 40%",null,null,"Change in Residual (£/kW)"]
["Zone","Zone Name","2019/20 April (£/kW)","2019/20 June (£/kW)","Change (£/kW)","2019/20 April (£/kW)","2019/20 June (£/kW)","Change (£/kW)","2019/20 April (£/kW)","2019/20 June (£/kW)","Change (£/kW)"]
[1,"North Scotland",26.657823,26.345707599999997,{"$f":"D7-C7","v":-0.31211540000000326},29.926952,29.6038204,{"$f":"G7-F7","v":-0.32313159999999996},20.168315,19.823923199999999,{"$f":"J7-I7","v":-0.34439180000000036},-0.32182036516976531]
[2,"East Aberdeenshire",22.8946422,22.587712,{"$f":"D8-C8","v":-0.30693020000000004},26.163771199999999,25.845824799999999,{"$f":"G8-F8","v":-0.3179464000000003},17.175398600000001,16.833454399999997,{"$f":"J8-I8","v":-0.34194420000000392},-0.32182036516976531]
{"$rows_left_out":28}
{"sheet":"T9","index":10,"n_rows":9,"n_cols":5,"rows_kept":9,"cut":false,"hidden":false,"merged":[[3,0,4,0],[3,1,4,1],[2,0,2,4],[3,2,4,2],[3,3,4,3],[3,4,4,4]]}
["Table 9 - Local Substation Tariffs",null,null,null,"Return to Index"]
[]
["2019/20 Local Substation Tariff (£/kW)"]
["Substation\nRating","Connection\nType","132kV","275kV","400kV"]
[]
["<1320 MW","No redundancy",0.197964,0.113248,8.1598000000000004E-2]
["<1320 MW","Redundancy",0.43609799999999999,0.26981699999999997,0.19623199999999999]
[">=1320 MW","No redundancy",0,0.35508299999999998,0.256797]
{"$rows_left_out":2}
{"sheet":"T10","index":11,"n_rows":29,"n_cols":8,"rows_kept":29,"cut":false,"hidden":false,"merged":[[0,0,0,5]]}
["Table 10 - Onshore Local Circuit Tariffs",null,null,null,null,null,null,"Return to Index"]
[]
["Substation Name","(£/kW)","Substation Name","(£/kW)","Substation Name","(£/kW)"]
["Achruach",4.232856,"Dunlaw Extension",1.4797499999999999,"Lochay",0.36081999999999997]
["Aigas",0.644872,"Dunhill",1.412272,"Luichart",0.56547400000000003]
["An Suidhe",-0.94106999999999996,"Dumnaglass",1.830606,"Mark Hill",0.86331100000000005]
["Arecleoch",2.0478710000000002,"Edinbane",6.7480669999999998,"Marchwood",0.37631399999999998]
["Baglan Bay",0.75011499999999998,"Ewe Hill",1.354956,"Millennium Wind ",1.8007850000000001]
{"$rows_left_out":22}
{"sheet":"T10 A-Z","index":12,"n_rows":29,"n_cols":8,"rows_kept":29,"cut":false,"hidden":false,"merged":[[0,0,0,5]]}
["Table 10 - Onshore Local Circuit Tariffs",null,null,null,null,null,null,"Return to Index"]
[]
["Substation Name","(£/kW)","Substation Name","(£/kW)","Substation Name","(£/kW)"]
["Achruach",{"$f":"IF(ISNA(VLOOKUP(A4,'T10'!$A$4:$B$29,2,0)),IF(ISNA(VLOOKUP(A4,'T10'!$C$4:$D$29,2,0)),VLOOKUP(A4,'T10'!$E$4:$F$29,2,0),VLOOKUP(A4,'T10'!$C$4:$D$29,2,0)),VLOOKUP(A4,'T10'!$A$4:$B$29,2,0))","v":4.232856},"Dumnaglass",{"$f":"IF(ISNA(VLOOKUP(C4,'T10'!$A$4:$B$29,2,0)),IF(ISNA(VLOOKUP(C4,'T10'!$C$4:$D$29,2,0)),VLOOKUP(C4,'T10'!$E$4:$F$29,2,0),VLOOKUP(C4,'T10'!$C$4:$D$29,2,0)),VLOOKUP(C4,'T10'!$A$4:$B$29,2,0))","v":1.830606},"Langage",{"$f":"IF(ISNA(VLOOKUP(E4,'T10'!$A$4:$B$29,2,0)),IF(ISNA(VLOOKUP(E4,'T10'!$C$4:$D$29,2,0)),VLOOKUP(E4,'T10'!$E$4:$F$29,2,0),VLOOKUP(E4,'T10'!$C$4:$D$29,2,0)),VLOOKUP(E4,'T10'!$A$4:$B$29,2,0))","v":0.648563}]
["Aberdeen Bay",{"$f":"IF(ISNA(VLOOKUP(A5,'T10'!$A$4:$B$29,2,0)),IF(ISNA(VLOOKUP(A5,'T10'!$C$4:$D$29,2,0)),VLOOKUP(A5,'T10'!$E$4:$F$29,2,0),VLOOKUP(A5,'T10'!$C$4:$D$29,2,0)),VLOOKUP(A5,'T10'!$A$4:$B$29,2,0))","v":2.5708440000000001},"Dunhill",{"$f":"IF(ISNA(VLOOKUP(C5,'T10'!$A$4:$B$29,2,0)),IF(ISNA(VLOOKUP(C5,'T10'!$C$4:$D$29,2,0)),VLOOKUP(C5,'T10'!$E$4:$F$29,2,0),VLOOKUP(C5,'T10'!$C$4:$D$29,2,0)),VLOOKUP(C5,'T10'!$A$4:$B$29,2,0))","v":1.412272},"Lochay",{"$f":"IF(ISNA(VLOOKUP(E5,'T10'!$A$4:$B$29,2,0)),IF(ISNA(VLOOKUP(E5,'T10'!$C$4:$D$29,2,0)),VLOOKUP(E5,'T10'!$E$4:$F$29,2,0),VLOOKUP(E5,'T10'!$C$4:$D$29,2,0)),VLOOKUP(E5,'T10'!$A$4:$B$29,2,0))","v":0.36081999999999997}]
["Aigas",{"$f":"IF(ISNA(VLOOKUP(A6,'T10'!$A$4:$B$29,2,0)),IF(ISNA(VLOOKUP(A6,'T10'!$C$4:$D$29,2,0)),VLOOKUP(A6,'T10'!$E$4:$F$29,2,0),VLOOKUP(A6,'T10'!$C$4:$D$29,2,0)),VLOOKUP(A6,'T10'!$A$4:$B$29,2,0))","v":0.644872},"Dunlaw Extension",{"$f":"IF(ISNA(VLOOKUP(C6,'T10'!$A$4:$B$29,2,0)),IF(ISNA(VLOOKUP(C6,'T10'!$C$4:$D$29,2,0)),VLOOKUP(C6,'T10'!$E$4:$F$29,2,0),VLOOKUP(C6,'T10'!$C$4:$D$29,2,0)),VLOOKUP(C6,'T10'!$A$4:$B$29,2,0))","v":1.4797499999999999},"Luichart",{"$f":"IF(ISNA(VLOOKUP(E6,'T10'!$A$4:$B$29,2,0)),IF(ISNA(VLOOKUP(E6,'T10'!$C$4:$D$29,2,0)),VLOOKUP(E6,'T10'!$E$4:$F$29,2,0),VLOOKUP(E6,'T10'!$C$4:$D$29,2,0)),VLOOKUP(E6,'T10'!$A$4:$B$29,2,0))","v":0.56547400000000003}]
["An Suidhe",{"$f":"IF(ISNA(VLOOKUP(A7,'T10'!$A$4:$B$29,2,0)),IF(ISNA(VLOOKUP(A7,'T10'!$C$4:$D$29,2,0)),VLOOKUP(A7,'T10'!$E$4:$F$29,2,0),VLOOKUP(A7,'T10'!$C$4:$D$29,2,0)),VLOOKUP(A7,'T10'!$A$4:$B$29,2,0))","v":-0.94106999999999996},"Edinbane",{"$f":"IF(ISNA(VLOOKUP(C7,'T10'!$A$4:$B$29,2,0)),IF(ISNA(VLOOKUP(C7,'T10'!$C$4:$D$29,2,0)),VLOOKUP(C7,'T10'!$E$4:$F$29,2,0),VLOOKUP(C7,'T10'!$C$4:$D$29,2,0)),VLOOKUP(C7,'T10'!$A$4:$B$29,2,0))","v":6.7480669999999998},"Marchwood",{"$f":"IF(ISNA(VLOOKUP(E7,'T10'!$A$4:$B$29,2,0)),IF(ISNA(VLOOKUP(E7,'T10'!$C$4:$D$29,2,0)),VLOOKUP(E7,'T10'!$E$4:$F$29,2,0),VLOOKUP(E7,'T10'!$C$4:$D$29,2,0)),VLOOKUP(E7,'T10'!$A$4:$B$29,2,0))","v":0.37631399999999998}]
["Arecleoch",{"$f":"IF(ISNA(VLOOKUP(A8,'T10'!$A$4:$B$29,2,0)),IF(ISNA(VLOOKUP(A8,'T10'!$C$4:$D$29,2,0)),VLOOKUP(A8,'T10'!$E$4:$F$29,2,0),VLOOKUP(A8,'T10'!$C$4:$D$29,2,0)),VLOOKUP(A8,'T10'!$A$4:$B$29,2,0))","v":2.0478710000000002},"Ewe Hill",{"$f":"IF(ISNA(VLOOKUP(C8,'T10'!$A$4:$B$29,2,0)),IF(ISNA(VLOOKUP(C8,'T10'!$C$4:$D$29,2,0)),VLOOKUP(C8,'T10'!$E$4:$F$29,2,0),VLOOKUP(C8,'T10'!$C$4:$D$29,2,0)),VLOOKUP(C8,'T10'!$A$4:$B$29,2,0))","v":1.354956},"Mark Hill",{"$f":"IF(ISNA(VLOOKUP(E8,'T10'!$A$4:$B$29,2,0)),IF(ISNA(VLOOKUP(E8,'T10'!$C$4:$D$29,2,0)),VLOOKUP(E8,'T10'!$E$4:$F$29,2,0),VLOOKUP(E8,'T10'!$C$4:$D$29,2,0)),VLOOKUP(E8,'T10'!$A$4:$B$29,2,0))","v":0.86331100000000005}]
{"$rows_left_out":22}
{"sheet":"T11","index":13,"n_rows":17,"n_cols":5,"rows_kept":17,"cut":false,"hidden":false,"merged":[]}
["Table 11 - CMP203: Circuits subject to one-off charges",null,null,null,"Return to Index"]
[]
["Node 1","Node 2","Actual Parameters","Amendment in Transport Model","Generator"]
["Dyce 132kV","Aberdeen Bay 132kV","9.5km of Cable","9.5km of OHL","Aberdeen Bay"]
["Crystal Rig 132kV","Wester Dod 132kV","3.9km of Cable","3.9km of OHL","Aikengall II"]
["Wishaw 132kV","Blacklaw 132kV","11.46km of Cable","11.46km of OHL","Blacklaw"]
["Farigaig 132kV","Corriegarth 132kV","4km Cable","4km OHL","Corriegarth"]
["Elvanfoot 275kV","Clyde North 275kV","6.2km of Cable","6.2km of OHL","Clyde North"]
{"$rows_left_out":10}
{"sheet":"T12","index":14,"n_rows":21,"n_cols":4,"rows_kept":21,"cut":false,"hidden":false,"merged":[[2,0,3,0],[2,1,2,3],[5,1,5,3]]}
["Table 12 - Offshore Local Tariffs",null,null,"Return to Index"]
[]
["Offshore Generator","Tariff Component (£/kW)"]
[null,"Substation","Circuit","ETUoS"]
["Barrow",7.9750719999999999,41.725569999999998,1.036103]
["Burbo Bank","Tariff will be published in November 2018"]
["Greater Gabbard",14.952322961002251,34.358965851182582,0]
["Gunfleet",17.259781,15.845829999999999,2.9616769999999999]
{"$rows_left_out":14}
{"sheet":"T13","index":15,"n_rows":6,"n_cols":7,"rows_kept":6,"cut":false,"hidden":false,"merged":[[0,0,0,4]]}
["Table 13 - Contracted and Modelled TEC",null,null,null,null,"Return to Index"]
[]
["(GW)","2018/19","2019/20 Initial Forecast","2019/20 April Forecast","2019/20 June Forecast","2019/20 Draft Tariffs","2019/20 Final Tariffs"]
["Contracted TEC",79.028809999999993,85.464610000000022,{"$f":"85938.76/1000","v":85.938759999999988},83.9]
["Modelled Best View TEC",79.028809999999993,77.680610000000016,{"$f":"77496.86/1000","v":77.496859999999998},77.7]
["Chargeable TEC",71.934310000000025,73.833610000000022,{"$f":"71711.76/1000","v":71.711759999999998},71.900000000000006]

{"sheet":"T14","index":16,"n_rows":9,"n_cols":7,"rows_kept":9,"cut":false,"hidden":false,"merged":[]}
["Table 14 - Interconnectors",null,null,null,null,null,"Return to Index"]
[]
["Interconnector","Site","Interconnected\nSystem","Generation\nZone","Transport Model (Generation MW) Peak","Transport Model (Generation MW) Year Round","Charging Base (Generation MW)"]
["IFA Interconnector","Sellindge 400kV","France",24,0,2000,0]
["ElecLink","Sellindge 400kV","France",24,0,1000,0]
["BritNed","Grain 400kV","Netherlands",24,0,1200,0]
["Belgium Interconnector (Nemo)","Richborough 400kV","Belgium",24,0,1000,0]
["East - West","Connah's Quay 400kV","Republic of Ireland",16,0,505,0]
{"$rows_left_out":2}
{"sheet":"T15","index":17,"n_rows":24,"n_cols":7,"rows_kept":24,"cut":false,"hidden":false,"merged":[[2,0,3,0],[2,2,2,6]]}
["Table 15 - Allowed Revenues",null,null,null,null,null,"Return to Index"]
[]
["£m Nominal Value","2018/19 TNUoS Revenue","2019/20 TNUoS Revenue"]
[null,{"$f":"'T26'!D5","v":"2018/19 (fixed forecast)"},{"$f":"'T26'!E5","v":"Initial Forecast"},{"$f":"'T26'!F5","v":"April Forecast"},{"$f":"'T26'!G5","v":"June Forecast"},{"$f":"'T26'!H5","v":"Nov Draft"},"Jan \n2019 Final"]
["National Grid"]
["Price controlled revenue",1653.9179700263246,1768.5197291650261,1728.1223686166347,1770.6013999438635]
["Less income from connections",44.002400999999999,41.882612399999999,44.002400999999999,44.002400999999999]
["Income from TNUoS",{"$f":"+B6-B7","v":1609.9155690263246},1726.6371167650261,1684.1199676166348,1726.5989989438635]
{"$rows_left_out":17}
{"sheet":"T16","index":18,"n_rows":12,"n_cols":7,"rows_kept":12,"cut":false,"hidden":false,"merged":[[0,0,0,5]]}
["Table 16 - Generation and Demand Revenue Proportions",null,null,null,null,null,"Return to Index"]
[]
[null,null,"2019/20 Initial  ","2019/20 April  ","2019/20 June","2019/20 Draft","2019/20 Final  "]
["CAPEC","Limit on generation tariff (€/MWh)",2.5,2.5,2.5]
["y","Error Margin",0.21,0.21,0.21]
["ER","Exchange Rate (€/£)",1.0900000000000001,1.1299999999999999,1.124927]
["MAR","Total Revenue (£m)",2968.3616850621493,2835.8126099188039,2879.2521943684746]
["GO","Generation Output (TWh)",243.12236122457247,247.03485845324252,229.83357135990477]
{"$rows_left_out":5}
{"sheet":"T17","index":19,"n_rows":12,"n_cols":5,"rows_kept":12,"cut":false,"hidden":false,"merged":[]}
["Table 17 - Charging Bases",null,null,null,"Return to Index"]
[]
["Charging Bases","2019/20 April ","2019/20 June","2019/20 Draft","2019/20 Final  "]
["Generation (GW)",71.711759999999984,71.910959999999989]
["NHH Demand (4pm-7pm TWh)",25.512098981321838,25.512098981321838]
["Net Charging"]
["Total Average Net Triad (GW)",43.572821858760001,43.572821858760001]
["HH  Demand Average Net Triad (GW)",10.254642452956,10.254642452956]
{"$rows_left_out":5}
{"sheet":"T18","index":20,"n_rows":18,"n_cols":6,"rows_kept":18,"cut":false,"hidden":false,"merged":[[0,0,0,4]]}
["Table 18 - Residual Calculation",null,null,null,null,"Return to Index"]
[]
[null,"Component","2019/20 April","2019/20 June","2019/20 Draft","2019/20 Final "]
["G","Proportion of revenue recovered from generation (%)",0.15225422987595574,0.14014464841765575]
["D","Proportion of revenue recovered from demand (%)",0.84774577012404428,0.85985535158234427]
["R","Total TNUoS revenue (£m)",2835.8126099188039,2879.2521943684746]
["Generation Residual"]
["RG","Generator residual tariff (£/kW)",-3.2912402716384705,-3.6130603651697628]
{"$rows_left_out":11}
{"sheet":"T20","index":21,"n_rows":20,"n_cols":7,"rows_kept":20,"cut":false,"hidden":false,"merged":[[4,0,5,0],[4,1,4,2],[4,3,4,4],[4,5,4,6]]}
["Table 20 - Demand Locational Tariffs",null,null,null,null,null,"Return to Index"]
[]
[]
[]
["Zone","2019/20 April","2019/20 April","2019/20 June","2019/20 June (£/kW)","Changes"]
[null,"Peak (£/kW)","Year Round (£/kW)","Peak (£/kW)","Year Round (£/kW)","Peak (£/kW)","Year Round (£/kW)"]
[1,-2.0479069678368464,-28.513682926796921,-2.0412450726915945,-28.538571553183434,6.6618951452519504E-3,-2.4888626386513124E-2]
[2,-2.2402753456840774,-20.639596648935001,-2.2447355247916572,-20.655198530507644,-4.460179107579787E-3,-1.560188157264264E-2]
{"$rows_left_out":13}
{"sheet":"T21","index":22,"n_rows":18,"n_cols":12,"rows_kept":18,"cut":false,"hidden":false,"merged":[[2,0,3,1],[2,2,2,4],[2,5,2,7],[2,8,2,10]]}
["Table 21 - Breakdown of the Embedded Export Tariff",null,null,null,null,null,null,null,null,null,null,"Return to Index"]
[]
["Demand Zone",null,"2019/20 April",null,null,"2019/20 June",null,null,"Changes"]
[null,null,"Locational (£/kW)","AGIC (£/kW)","Phased Residual (£/kW)","Locational (£/kW)","AGIC (£/kW)","Phased Residual (£/kW)","Locational (£/kW)","AGIC (£/kW)","Phased Residual (£/kW)"]
[1,"Northern Scotland",-30.561589894633769,3.32,14.65,-30.579816625875029,3.3272680000000001,14.65,{"$f":"F5-C5","v":-1.8226731241259841E-2},{"$f":"G5-D5","v":7.2680000000002742E-3},0]
[2,"Southern Scotland",-22.87987199461908,3.32,14.65,-22.899934055299301,3.3272680000000001,14.65,{"$f":"F6-C6","v":-2.0062060680221094E-2},{"$f":"G6-D6","v":7.2680000000002742E-3},{"$f":"H6-E6","v":0}]
[3,"Northern",-10.405887080584002,3.32,14.65,-10.404937073746092,3.3272680000000001,14.65,9.5000683790935625E-4,7.2680000000002742E-3,0]
[4,"North West",-3.5762140777170845,3.32,14.65,-3.56811297607406,3.3272680000000001,14.65,8.1011016430245775E-3,7.2680000000002742E-3,0]
{"$rows_left_out":11}
{"sheet":"T22","index":23,"n_rows":19,"n_cols":12,"rows_kept":19,"cut":false,"hidden":false,"merged":[[18,0,18,1],[2,0,3,0],[2,1,3,1],[2,2,2,6],[2,7,2,11]]}
["Table 22 - Demand Profiles",null,null,null,null,null,null,"Return to Index"]
[]
["Zone","Zone Name","2019/20 April","2019/20 April","2019/20 April","2019/20 April","2019/20 April","2019/20 June","2019/20 June","2019/20 June","2019/20 June","2019/20 June"]
[null,null,"Locational Model Demand (MW)","GROSS Tariff model Peak Demand (MW)","GROSS Tariff Model HH Demand (MW)","Tariff model NHH Demand (TWh)","Tariff model Embedded Export (MW)","Locational Model Demand (MW)","GROSS Tariff model Peak Demand (MW)","GROSS Tariff Model HH Demand (MW)","Tariff model NHH Demand (TWh)","Tariff model Embedded Export (MW)"]
[1,"Northern Scotland",499.4470878504585,1483.1581980599999,427.58099095348541,0.78417740827603,958.03354100000001,499.4470878504585,1483.1581980599999,427.58099095348541,0.78417740827603,958.03354100000001]
[2,"Southern Scotland",2695.2802337591597,3444.3512881749998,1125.6193456983801,1.7712229685994472,678.45211199999994,2695.2802337591597,3444.3512881749998,1125.6193456983801,1.7712229685994472,678.45211199999994]
[3,"Northern",2702.3018897993657,2575.9529187349995,902.07940785267442,1.3176976488981178,438.64920239999998,2702.3018897993657,2575.9529187349995,902.07940785267442,1.3176976488981178,438.64920239999998]
[4,"North West",3067.4972273778667,4037.4046861050001,1413.353912556697,2.023841932113466,410.12000715000005,3067.4972273778667,4037.4046861050001,1413.353912556697,2.023841932113466,410.12000715000005]
{"$rows_left_out":12}
{"sheet":"T23","index":24,"n_rows":142,"n_cols":13,"rows_kept":142,"cut":false,"hidden":false,"merged":[[4,0,5,0],[4,1,5,1],[4,2,4,6],[4,7,4,11],[4,12,5,12]]}
["Table 23 - Annual Load Factors",null,null,null,null,null,null,null,null,null,null,"Return to Index"]
[]
[]
[]
["Power Station","Technology","Yearly Load Factor Source",null,null,null,null,"Yearly Load Factor Value",null,null,null,null,"Specific ALF"]
[null,null,2012,2013,2014,2015,2016,2012,2013,2014,2015,2016]
["ABERTHAW","Coal","Actual","Actual","Actual","Actual","Actual",0.74013700000000004,0.65541300000000002,0.59004299999999998,0.54261099999999995,0.50833499999999998,0.59602200000000005]
["ACHRUACH","Onshore_Wind","Generic","Generic","Generic","Partial","Actual",0,0,0,0.33646399999999999,0.36714000000000002,0.34899400000000003]
{"$rows_left_out":135}
{"sheet":"T24","index":25,"n_rows":15,"n_cols":5,"rows_kept":15,"cut":false,"hidden":false,"merged":[]}
["Table 24 - Generic Annual Load Factors",null,null,null,"Return to Index"]
[]
[]
["Technology","Generic ALF"]
["Gas_Oil",1.89E-3]
["Pumped_Storage",0.104412]
["Tidal",0.189]
["Biomass",0.268847]
{"$rows_left_out":8}
{"sheet":"T25","index":26,"n_rows":12,"n_cols":5,"rows_kept":12,"cut":false,"hidden":false,"merged":[]}
["Table 25 - Generation Contracted TEC Changes",null,null,null,"Return to Index"]
[]
[]
["Power Station","Node","MW Change","Generation Zone"]
["Blacklaw Extension",-9,"BLKX10",11]
["Cowes",140,"FAWL40",26]
["Didcot B",-100,"DIDC40",25]
["Liberty Steel Dalzell",18,"WISH10",11]
{"$rows_left_out":5}
{"sheet":"T26","index":27,"n_rows":43,"n_cols":9,"rows_kept":43,"cut":false,"hidden":false,"merged":[]}
["Table 26 - Indicative National Grid Revenue Forecast",null,null,null,null,null,null,null,"Return to Index"]
[]
[null,null,null,null,null,null,null,null," "]
["Description"," ",null,null,null,null,null,null,"Notes"]
["Regulatory Year"," ","Licence Term","2018/19 (fixed forecast)","Initial Forecast","April Forecast","June Forecast","Nov Draft"]
["Actual RPI"," "," "," ",null,null,null,null,"April to March average"]
["RPI Actual"," ","RPIAt"," ",null,null,null,null,"Office of National Statistics"]
["Assumed Interest Rate"," ","It",7.0500000000000007E-3,5.6249999999999998E-3,1.1599999999999999E-2,1.1599999999999999E-2,null,"Bank of England Base Rate"]
{"$rows_left_out":36}
{"sheet":"T27","index":28,"n_rows":32,"n_cols":11,"rows_kept":32,"cut":false,"hidden":false,"merged":[[2,1,2,6],[20,5,22,5],[20,6,22,6],[3,7,4,7],[14,1,17,1],[17,2,19,2],[18,3,19,3]]}
["Table 27 - Offshore Revenues",null,null,null,null,null,null,"Return to Index"]
[]
["Offshore Transmission Revenue Forecast (£m)","2018-04-23",null,null,null,null,null,null,null,null," "]
[null,null,null,null,null,null,null,"Notes"]
["Regulatory Year","2014/15","2015/16","2016/17","2017/18","2018/19","2019/20"]
["Barrow",5.4759483870350794,5.6051191659779338,5.6562830188883408,5.8724963671592052,6.250052539232863,6.1694894992964837,"Current revenues plus indexation"]
["Gunfleet",6.8531524225899307,7.0144590179136701,7.0805945993165489,7.4324222805755404,7.8017526906474828,7.7205088618084137,"Current revenues plus indexation"]
["Walney 1",12.491059506303356,12.786364558839976,12.901841570954671,13.136098252828528,13.607167459943749,14.069129245606696,"Current revenues plus indexation"]
{"$rows_left_out":24}