{"text_format":"1","workbook":"xlsx","n_sheets":5,"sheets":["Inputs","Report","Data","Constants","Version Control"],"not_rendered":{"charts":0,"images":0,"macros":1,"external_links":1,"defined_names":89,"comments":0,"pivot_tables":0},"unopened":[],"bounds":{"document_bytes":16777216,"sheet_cells":100000,"rows_first":2000,"rows_last":500,"rows_between":2000,"halvings":0,"cell_chars":16384,"cell_head_chars":4096},"cells_cut":0,"cells_raw":0,"read":"whole","date_system":"1900"}

{"sheet":"Inputs","index":0,"n_rows":50,"n_cols":8,"rows_kept":50,"cut":false,"hidden":false,"merged":[]}
[null,"BSUoS Report:"]
[]
[null,"Input Dates","Date"]
[null,"Report Date","2018-06-01"]
[null,"Input Data From","2018-05-02"]
[null,"Input Data To","2018-06-05"]
[]
[null,"Step","Macro","Complete?"]
[null,"Set-up spreadsheet",null,"Y"]
[null,"Import Demand Data",null,"Y"]
[null,"Import Cost Data",null,"Y"]
[null,"Export Report",null,"Y"]
[null,"Save & close",null,"Y"]
[]
[null,"Date","Initial\nForecast","Indicative\nOutturn"]
[null,{"$f":"Input_Data_To","v":"2018-06-05"},{"$f":"VLOOKUP(B16,Data!A2:L2863,6,)","v":0.43815987599972278},{"$f":"IF(B16>=TODAY(),\"\",ROUND(VLOOKUP($B16,Data!$A:$K,11),3))","v":""}]
[null,{"$f":"IF(B16-1<Input_Data_From,\"\",B16-1)","v":"2018-06-04"},{"$f":"VLOOKUP(B17,Data!A3:L2864,6,)","v":0.43821933386531287},{"$f":"IF(B17>=TODAY(),\"\",ROUND(VLOOKUP($B17,Data!$A:$K,11),3))","v":""}]
[null,"2018-06-03",{"$f":"VLOOKUP(B18,Data!A4:L2865,6,)","v":0.50732470317833556},{"$f":"IF(B18>=TODAY(),\"\",ROUND(VLOOKUP($B18,Data!$A:$K,11),3))","v":""},null,null,null," "]
[null,"2018-06-02",{"$f":"VLOOKUP(B19,Data!A5:L2866,6,)","v":0.50906411706247223},{"$f":"IF(B19>=TODAY(),\"\",ROUND(VLOOKUP($B19,Data!$A:$K,11),3))","v":""}]
[null,"2018-06-01",{"$f":"VLOOKUP(B20,Data!A6:L2867,6,)","v":0.4434209230199786},{"$f":"IF(B20>=TODAY(),\"\",ROUND(VLOOKUP($B20,Data!$A:$K,11),3))","v":""}]
[null,"2018-05-31",{"$f":"VLOOKUP(B21,Data!A7:L2868,6,)","v":0.42431461264688913},{"$f":"IF(B21>=TODAY(),\"\",ROUND(VLOOKUP($B21,Data!$A:$K,11),3))","v":0.42899999999999999}]
[null,"2018-05-30",{"$f":"VLOOKUP(B22,Data!A8:L2869,6,)","v":0.42431521864873245},{"$f":"IF(B22>=TODAY(),\"\",ROUND(VLOOKUP($B22,Data!$A:$K,11),3))","v":0.42699999999999999}]
[null,"2018-05-29",{"$f":"VLOOKUP(B23,Data!A9:L2870,6,)","v":0.42431582465230672},{"$f":"IF(B23>=TODAY(),\"\",ROUND(VLOOKUP($B23,Data!$A:$K,11),3))","v":0.45300000000000001}]
[null,"2018-05-28",{"$f":"VLOOKUP(B24,Data!A10:L2871,6,)","v":0.42431643065761193},{"$f":"IF(B24>=TODAY(),\"\",ROUND(VLOOKUP($B24,Data!$A:$K,11),3))","v":0.51700000000000002}]
[null,"2018-05-27",{"$f":"VLOOKUP(B25,Data!A11:L2872,6,)","v":0.42431703666464815},{"$f":"IF(B25>=TODAY(),\"\",ROUND(VLOOKUP($B25,Data!$A:$K,11),3))","v":0.55800000000000005}]
[null,"2018-05-26",{"$f":"VLOOKUP(B26,Data!A12:L2873,6,)","v":0.42431764267341537},{"$f":"IF(B26>=TODAY(),\"\",ROUND(VLOOKUP($B26,Data!$A:$K,11),3))","v":0.54600000000000004}]
[null,"2018-05-25",{"$f":"VLOOKUP(B27,Data!A13:L2874,6,)","v":0.42431824868391366},{"$f":"IF(B27>=TODAY(),\"\",ROUND(VLOOKUP($B27,Data!$A:$K,11),3))","v":0.439}]
[null,"2018-05-24",{"$f":"VLOOKUP(B28,Data!A14:L2875,6,)","v":0.4446959049359599},{"$f":"IF(B28>=TODAY(),\"\",ROUND(VLOOKUP($B28,Data!$A:$K,11),3))","v":0.436}]
[null,"2018-05-23",{"$f":"VLOOKUP(B29,Data!A15:L2876,6,)","v":0.45459274854946508},{"$f":"IF(B29>=TODAY(),\"\",ROUND(VLOOKUP($B29,Data!$A:$K,11),3))","v":0.46300000000000002}]
[null,"2018-05-22",{"$f":"VLOOKUP(B30,Data!A16:L2877,6,)","v":0.45856832837875799},{"$f":"IF(B30>=TODAY(),\"\",ROUND(VLOOKUP($B30,Data!$A:$K,11),3))","v":0.47599999999999998}]
[null,"2018-05-21",{"$f":"VLOOKUP(B31,Data!A17:L2878,6,)","v":0.46222756033773266},{"$f":"IF(B31>=TODAY(),\"\",ROUND(VLOOKUP($B31,Data!$A:$K,11),3))","v":0.45400000000000001}]
[null,"2018-05-20",{"$f":"VLOOKUP(B32,Data!A18:L2879,6,)","v":0.55487386938145855},{"$f":"IF(B32>=TODAY(),\"\",ROUND(VLOOKUP($B32,Data!$A:$K,11),3))","v":0.55500000000000005}]
[null,"2018-05-19",{"$f":"VLOOKUP(B33,Data!A19:L2880,6,)","v":0.52651725934563709},{"$f":"IF(B33>=TODAY(),\"\",ROUND(VLOOKUP($B33,Data!$A:$K,11),3))","v":0.53}]
[null,"2018-05-18",{"$f":"VLOOKUP(B34,Data!A20:L2881,6,)","v":0.44478777889062054},{"$f":"IF(B34>=TODAY(),\"\",ROUND(VLOOKUP($B34,Data!$A:$K,11),3))","v":0.44900000000000001}]
[null,"2018-05-17",{"$f":"VLOOKUP(B35,Data!A21:L2882,6,)","v":0.45712544870147759},{"$f":"IF(B35>=TODAY(),\"\",ROUND(VLOOKUP($B35,Data!$A:$K,11),3))","v":0.44900000000000001}]
[null,"2018-05-16",{"$f":"VLOOKUP(B36,Data!A22:L2883,6,)","v":0.435482357907574},{"$f":"IF(B36>=TODAY(),\"\",ROUND(VLOOKUP($B36,Data!$A:$K,11),3))","v":0.44}]
[null,"2018-05-15",{"$f":"VLOOKUP(B37,Data!A23:L2884,6,)","v":0.42432430888410277},{"$f":"IF(B37>=TODAY(),\"\",ROUND(VLOOKUP($B37,Data!$A:$K,11),3))","v":0.45300000000000001}]
[null,"2018-05-14",{"$f":"VLOOKUP(B38,Data!A24:L2885,6,)","v":0.42432491491364255},{"$f":"IF(B38>=TODAY(),\"\",ROUND(VLOOKUP($B38,Data!$A:$K,11),3))","v":0.46}]
[null,"2018-05-13",{"$f":"VLOOKUP(B39,Data!A25:L2886,6,)","v":0.42432552094491338},{"$f":"IF(B39>=TODAY(),\"\",ROUND(VLOOKUP($B39,Data!$A:$K,11),3))","v":0.51200000000000001}]
[null,"2018-05-12",{"$f":"VLOOKUP(B40,Data!A26:L2887,6,)","v":0.42432612697791533},{"$f":"IF(B40>=TODAY(),\"\",ROUND(VLOOKUP($B40,Data!$A:$K,11),3))","v":0.47299999999999998}]
[null,"2018-05-11",{"$f":"VLOOKUP(B41,Data!A27:L2888,6,)","v":0.42432673301264839},{"$f":"IF(B41>=TODAY(),\"\",ROUND(VLOOKUP($B41,Data!$A:$K,11),3))","v":0.46400000000000002}]
[null,"2018-05-10",{"$f":"VLOOKUP(B42,Data!A28:L2889,6,)","v":0.42432733904911257},{"$f":"IF(B42>=TODAY(),\"\",ROUND(VLOOKUP($B42,Data!$A:$K,11),3))","v":0.45600000000000002}]
[null,"2018-05-09",{"$f":"VLOOKUP(B43,Data!A29:L2890,6,)","v":0.42432794508730787},{"$f":"IF(B43>=TODAY(),\"\",ROUND(VLOOKUP($B43,Data!$A:$K,11),3))","v":0.44600000000000001}]
[null,"2018-05-08",{"$f":"VLOOKUP(B44,Data!A30:L2891,6,)","v":0.42432855112723433},{"$f":"IF(B44>=TODAY(),\"\",ROUND(VLOOKUP($B44,Data!$A:$K,11),3))","v":0.44800000000000001}]
[null,"2018-05-07",{"$f":"VLOOKUP(B45,Data!A31:L2892,6,)","v":0.42432915716889186},{"$f":"IF(B45>=TODAY(),\"\",ROUND(VLOOKUP($B45,Data!$A:$K,11),3))","v":0.51700000000000002}]
[null,"2018-05-06",{"$f":"VLOOKUP(B46,Data!A32:L2893,6,)","v":0.42432976321228061},5.0220000000000002]
[null,"2018-05-05",{"$f":"VLOOKUP(B47,Data!A33:L2894,6,)","v":0.42433036925740047},{"$f":"IF(B47>=TODAY(),\"\",ROUND(VLOOKUP($B47,Data!$A:$K,11),3))","v":0.51800000000000002}]
[null,"2018-05-04",{"$f":"VLOOKUP(B48,Data!A34:L2895,6,)","v":0.42433097530425146},{"$f":"IF(B48>=TODAY(),\"\",ROUND(VLOOKUP($B48,Data!$A:$K,11),3))","v":0.42499999999999999}]
[null,"2018-05-03",{"$f":"VLOOKUP(B49,Data!A35:L2896,6,)","v":0.41404953264385469},{"$f":"IF(B49>=TODAY(),\"\",ROUND(VLOOKUP($B49,Data!$A:$K,11),3))","v":0.41899999999999998}]
[null,"2018-05-02",{"$f":"VLOOKUP(B50,Data!A36:L2897,6,)","v":0.40390225864426965},{"$f":"IF(B50>=TODAY(),\"\",ROUND(VLOOKUP($B50,Data!$A:$K,11),3))","v":0.41699999999999998}]

{"sheet":"Report","index":1,"n_rows":52,"n_cols":6,"rows_kept":52,"cut":false,"hidden":false,"merged":[[51,1,51,5],[8,1,8,5],[47,2,47,4],[48,2,48,4]]}
[]
[null,"Daily BSUoS Forecast",null,null,null,"nationalgrid"]
[]
[]
[]
[null,null,null,null,null,{"$f":"Report_Date","v":"2018-06-01"}]
[]
[]
[null,"This report contains National Grid's day-ahead forecasts of per-MWh BSUoS costs (Balancing Services Use of System, as defined in the CUSC). A forecast at monthly resolution reaching to the end of the current financial year can be found in the MBSS (Monthly Balancing Services Statement). Model adjusted 23/08/17."]
[]
[null,"Date","Initial\nForecast"]
[null,{"$f":"Input_Data_To","v":"2018-06-05"},1.08]
[null,{"$f":"IF(B12-1<Input_Data_From,\"\",B12-1)","v":"2018-06-04"},0.95199999999999996]
[null,"2018-06-03",1.028]
[null,"2018-06-02",1.048]
[null,"2018-06-01",2.048]
[null,"2018-05-31",0.88900000000000001]
[null,"2018-05-30",1.0900000000000001]
[null,"2018-05-29",1.2310000000000001]
[null,"2018-05-28",0.81699999999999995]
[null,"2018-05-27",0.78900000000000003]
[null,"2018-05-26",0.68100000000000005]
[null,"2018-05-25",0.59599999999999997]
[null,"2018-05-24",0.88900000000000001]
[null,"2018-05-23",0.54600000000000004]
[null,"2018-05-22",0.79300000000000004]
[null,"2018-05-21",1.177]
[null,"2018-05-20",1.21]
[null,"2018-05-19",0.99099999999999999]
[null,"2018-05-18",0.94699999999999995]
[null,"2018-05-17",1.103]
[null,"2018-05-16",0.68100000000000005]
[null,"2018-05-15",1.21]
[null,"2018-05-14",1.6879999999999999]
[null,"2018-05-13",1.81]
[null,"2018-05-12",1.9950000000000001]
[null,"2018-05-11",1.2809999999999999]
[null,"2018-05-10",1.2030000000000001]
[null,"2018-05-09",0.90300000000000002]
[null,"2018-05-08",1.3380000000000001]
[null,"2018-05-07",1.917]
[null,"2018-05-06",2.0529999999999999]
[null,"2018-05-05",2.274]
[null,"2018-05-04",1.5880000000000001]
[null,"2018-05-03",1.5740000000000001]
[null,"2018-05-02",4.3390000000000004]
[]
[null,"CUSC","Indicative Outturn can now be found on the website under:"]
[null,"MBSS","Daily Balancing Costs (BSUoS)"]
[]
[null,"Disclaimer"]
[null,"This forecast is published without prejudice and whilst every effort has been made to ensure the accuracy of the information, it is subject to several estimations and forecasts and may not bear relation to either the indicative or actual tariffs National Grid will publish at later dates."]

{"sheet":"Data","index":2,"n_rows":1283,"n_cols":11,"rows_kept":1283,"cut":false,"hidden":false,"merged":[]}
["BSUoS data:","Forecast Demand","Forecast BSUoS_ext","Forecast BSUoS_int","Forecast BSIS","Forecast BSUoS","Outturn Demand","Outturn BSUoS_ext","Outturn BSUoS_int","Outturn BSIS","Outturn BSUoS"]
["2015-04-01",858337.75,1.96,{"$f":"internal_BSUoS_cost_per_year/days_per_year","v":0.44931506849315067},{"$f":"forecast_BSIS_profit_per_year/days_per_year","v":2.1917808219178082E-2},{"$f":"BSUoS_per_SP(B2,C2,D2,E2)","v":1.4162253098429756},833176.5,4.24,{"$f":"internal_BSUoS_cost_per_year/days_per_year","v":0.44931506849315067},{"$f":"forecast_BSIS_profit_per_year/days_per_year","v":2.1917808219178082E-2},{"$f":"BSUoS_per_SP(G2,H2,I2,J2)","v":2.8272537855147051}]
["2015-04-02",881968.41666666663,1.97,0.44931506849315067,2.1917808219178082E-2,{"$f":"BSUoS_per_SP(B3,C3,D3,E3)","v":1.3839504381111332},846200,0.74,0.44931506849315067,2.1917808219178082E-2,{"$f":"BSUoS_per_SP(G3,H3,I3,J3)","v":0.71567005436067122}]
["2015-04-03",781351.41666666663,1.39,0.44931506849315067,2.1917808219178082E-2,1.1910140257067565,778983,2.61,0.44931506849315067,2.1917808219178082E-2,1.9777068305726826]
["2015-04-04",735119.58333333337,1.65,0.44931506849315067,2.1917808219178082E-2,1.4427576450103383,735810,1.92,0.44931506849315067,2.1917808219178082E-2,1.6248759870075156]
["2015-04-05",710810.25,1.89,0.44931506849315067,2.1917808219178082E-2,1.6609220466791406,692162,1.44,0.44931506849315067,2.1917808219178082E-2,1.3806016510585672]
["2015-04-06",728617.66666666663,1.7,0.44931506849315067,2.1917808219178082E-2,1.4899439761301532,691588.5,1.1299999999999999,0.44931506849315067,2.1917808219178082E-2,1.1576256383858596]
["2015-04-07",834689.58333333337,1.64,0.44931506849315067,2.1917808219178082E-2,1.2646611316776288,772717,0.51,0.44931506849315067,2.1917808219178082E-2,0.63490255811636087]
["2015-04-08",847339.16666666663,1.64,0.44931506849315067,2.1917808219178082E-2,1.2457823846181988,780483,0.34,0.44931506849315067,2.1917808219178082E-2,0.51967819926891423]
["2015-04-09",852126.83333333337,1.58,0.44931506849315067,2.1917808219178082E-2,{"$f":"BSUoS_per_SP(B10,C10,D10,E10)","v":1.2035764621940157},771303,0.46,0.44931506849315067,2.1917808219178082E-2,0.60365381698243104]
["2015-04-10",838750.25,1.92,0.44931506849315067,2.1917808219178082E-2,1.4254545454545453,742273.5,1.1000000000000001,0.44931506849315067,2.1917808219178082E-2,1.0583692814243797]
["2015-04-11",735119.58333333337,1.49,0.44931506849315067,2.1917808219178082E-2,1.333931875068016,639246,3.6,0.44931506849315067,2.1917808219178082E-2,3.1843765936744228]
["2015-04-12",710810.25,1.57,0.44931506849315067,2.1917808219178082E-2,1.4358267328822047,657395.5,3.97,0.44931506849315067,2.1917808219178082E-2,3.3778726977346989]
["2015-04-13",728617.66666666663,1.1399999999999999,0.44931506849315067,2.1917808219178082E-2,1.1056548150059426,788885.5,1.73,0.44931506849315067,2.1917808219178082E-2,1.3951318694969868]
["2015-04-14",834689.58333333337,1.67,0.44931506849315067,2.1917808219178082E-2,1.2826318753070001,755408,2.27,0.44931506849315067,2.1917808219178082E-2,1.8143837502382818]
["2015-04-15",847339.16666666663,1.99,0.44931506849315067,2.1917808219178082E-2,1.452311294535009,765546.5,1.51,0.44931506849315067,2.1917808219178082E-2,1.2939784154054752]
["2015-04-16",852126.83333333337,1.24,0.44931506849315067,2.1917808219178082E-2,1.004075683554212,783629,0.89,0.44931506849315067,2.1917808219178082E-2,0.86852324250378687]
["2015-04-17",838750.25,1.1399999999999999,0.44931506849315067,2.1917808219178082E-2,0.9604769001490312,763532.5,0.93,0.44931506849315067,2.1917808219178082E-2,0.91757778324942507]
["2015-04-18",735119.58333333337,1.18,0.44931506849315067,2.1917808219178082E-2,1.1230819458047665,658010.5,1.29,0.44931506849315067,2.1917808219178082E-2,1.3382775337760824]
["2015-04-19",710810.25,1.39,0.44931506849315067,2.1917808219178082E-2,1.3092106188714283,680019,1.87,0.44931506849315067,2.1917808219178082E-2,1.72142248966573]
["2015-04-20",808452.25,1.2,0.44931506849315067,2.1917808219178082E-2,1.0335802249236812,772062.5,0.92,0.44931506849315067,2.1917808219178082E-2,0.90096391222466587]
["2015-04-21",815808.25,1.1100000000000001,0.44931506849315067,2.1917808219178082E-2,0.96910057268376881,759755.5,0,0.44931506849315067,2.1917808219178082E-2,0.31009955827923702]
["2015-04-22",817100.58333333337,1.26,0.44931506849315067,2.1917808219178082E-2,1.0593549634622892,763455.5,0.52,0.44931506849315067,2.1917808219178082E-2,0.64915332383267665]
["2015-04-23",815186.91666666663,0.91,0.44931506849315067,2.1917808219178082E-2,0.84716758240747214,767437,0.7,0.44931506849315067,2.1917808219178082E-2,0.76305937816394043]
["2015-04-24",798538.58333333337,0.75,0.44931506849315067,2.1917808219178082E-2,0.76464643555292855,752688.5,1.22,0.44931506849315067,2.1917808219178082E-2,1.1234402567863444]
["2015-04-25",708715,1.35,0.44931506849315067,2.1917808219178082E-2,1.284860628038069,664838.5,2.97,0.44931506849315067,2.1917808219178082E-2,2.587998880930392]
["2015-04-26",684561.58333333337,1.6,0.44931506849315067,2.1917808219178082E-2,1.5127921210934876,666430.5,2.2599999999999998,0.44931506849315067,2.1917808219178082E-2,2.0491274402412856]
["2015-04-27",807037.33333333337,1.26,0.44931506849315067,2.1917808219178082E-2,1.0725654461939167,767294,1.95,0.44931506849315067,2.1917808219178082E-2,1.5777524651567716]
["2015-04-28",814777.75,1.04,0.44931506849315067,2.1917808219178082E-2,0.92736917295263255,754472.5,1.76,0.44931506849315067,2.1917808219178082E-2,1.4786499697801907]
["2015-04-29",790886.83333333337,1.1399999999999999,0.44931506849315067,2.1917808219178082E-2,1.018603163283756,768868,1.1499999999999999,0.44931506849315067,2.1917808219178082E-2,1.0542771971261646]
["2015-04-30",769569.91666666663,1.3,0.44931506849315067,2.1917808219178082E-2,1.1507725093233885,775059,1.41,0.44931506849315067,2.1917808219178082E-2,1.213585030300919]
["2015-05-01",767444.58333333337,1,0.44931506849315067,2.1917808219178082E-2,0.95850516975157829,772654.5,2.08,0.44931506849315067,2.1917808219178082E-2,1.6509330178838135]
["2015-05-02",688544.66666666663,1.83,0.44931506849315067,2.1917808219178082E-2,1.6710599888169981,691162,2.48,0.44931506849315067,2.1917808219178082E-2,2.1349553360861853]
["2015-05-03",650859.5,1.89,0.44931506849315067,2.1917808219178082E-2,1.8139077528193466,644463.5,4.26,0.44931506849315067,2.1917808219178082E-2,3.6706472355321629]
["2015-05-04",681252.58333333337,1.33,0.44931506849315067,2.1917808219178082E-2,1.3219758298312081,652408,2.64,0.44931506849315067,2.1917808219178082E-2,2.3843974935929664]
["2015-05-05",730812.66666666663,1.1299999999999999,0.44931506849315067,2.1917808219178082E-2,1.095492280514988,737444.5,2.42,0.44931506849315067,2.1917808219178082E-2,1.960284441937286]
["2015-05-06",743468.41666666663,2.9,0.44931506849315067,2.1917808219178082E-2,2.2672125767349769,756151.5,3.56,0.44931506849315067,2.1917808219178082E-2,2.6656016250700918]
["2015-05-07",752812.08333333337,2.77,0.44931506849315067,2.1917808219178082E-2,2.1527287025180257,774863,2.52,0.44931506849315067,2.1917808219178082E-2,1.9301476519074985]
["2015-05-08",756564,1.29,0.44931506849315067,2.1917808219178082E-2,1.1639464737946823,780407,1.9,0.44931506849315067,2.1917808219178082E-2,1.5192072854292695]
["2015-05-09",655351.66666666663,1.94,0.44931506849315067,2.1917808219178082E-2,1.8396220656990441,664331,3.36,0.44931506849315067,2.1917808219178082E-2,2.8835023504849238]
["2015-05-10",652669.41666666663,2.71,0.44931506849315067,2.1917808219178082E-2,2.4370699389736603,634158.5,3.43,0.44931506849315067,2.1917808219178082E-2,3.075889604798804]
["2015-05-11",697038.91666666663,3.65,0.44931506849315067,2.1917808219178082E-2,2.956219092475457,705944.5,4.42,0.44931506849315067,2.1917808219178082E-2,3.464297451355915]
["2015-05-12",756742.83333333337,2.5,0.44931506849315067,2.1917808219178082E-2,1.9631499729762945,711096,5.6,0.44931506849315067,2.1917808219178082E-2,4.2689032141933012]
["2015-05-13",736731.33333333337,2.36,0.44931506849315067,2.1917808219178082E-2,1.9214611574645291,742997.5,2.38,0.44931506849315067,2.1917808219178082E-2,1.918713105553447]
["2015-05-14",788620,2.37,0.44931506849315067,2.1917808219178082E-2,1.8013745530166621,787758.5,2.3199999999999998,0.44931506849315067,2.1917808219178082E-2,1.7716100629888873]
["2015-05-15",773853.16666666663,2.2999999999999998,0.44931506849315067,2.1917808219178082E-2,1.7905209387312575,738986,2.66,0.44931506849315067,2.1917808219178082E-2,2.1185787010850001]
["2015-05-16",657653.25,3.49,0.44931506849315067,2.1917808219178082E-2,3.0116185891343918,612193.5,5.24,0.44931506849315067,2.1917808219178082E-2,4.6645344449635244]
["2015-05-17",652669.41666666663,5.5,0.44931506849315067,2.1917808219178082E-2,4.57444738450884,615417.5,5.44,0.44931506849315067,2.1917808219178082E-2,4.8025894595218208]
["2015-05-18",697038.91666666663,1.84,0.44931506849315067,2.1917808219178082E-2,1.6578699326723469,745577.5,2.9,0.44931506849315067,2.1917808219178082E-2,2.260796321779881]
["2015-05-19",755558.08333333337,2.19,0.44931506849315067,2.1917808219178082E-2,1.7610825376741428,748776,3.36,0.44931506849315067,2.1917808219178082E-2,2.5583084927935724]
["2015-05-20",744412.91666666663,2.39,0.44931506849315067,2.1917808219178082E-2,1.921782666342474,752476.5,3.16,0.44931506849315067,2.1917808219178082E-2,2.4128344292708341]
["2015-05-21",739555.25,3.19,0.44931506849315067,2.1917808219178082E-2,2.4752722921216135,732347.5,1.82,0.44931506849315067,2.1917808219178082E-2,1.5642836465723946]
["2015-05-22",733356.91666666663,2.62,0.44931506849315067,2.1917808219178082E-2,2.1075683466579034,733223,3.13,0.44931506849315067,2.1917808219178082E-2,2.4557331125728461]
["2015-05-23",643995.66666666663,2.08,0.44931506849315067,2.1917808219178082E-2,1.9807576444574191,641773,2.0499999999999998,0.44931506849315067,2.1917808219178082E-2,1.9642459249610063]
["2015-05-24",616505.75,2.2599999999999998,0.44931506849315067,2.1917808219178082E-2,2.2150636003542541,608365,3.36,0.44931506849315067,2.1917808219178082E-2,3.1487675983989871]
["2015-05-25",697038.91666666663,2.5499999999999998,0.44931506849315067,2.1917808219178082E-2,2.1671671169045057,641270.5,3.49,0.44931506849315067,2.1917808219178082E-2,3.0885586414458808]
["2015-05-26",755558.08333333337,1.84,0.44931506849315067,2.1917808219178082E-2,1.529465639964106,706662.5,2.13,0.44931506849315067,2.1917808219178082E-2,1.8404838522518543]
["2015-05-27",744412.91666666663,1.88,0.44931506849315067,2.1917808219178082E-2,1.579230883931366,711160.5,2.2400000000000002,0.44931506849315067,2.1917808219178082E-2,1.9061814500253109]
["2015-05-28",730423.25,2.19,0.44931506849315067,2.1917808219178082E-2,1.8216841474049967,688359.5,2.82,0.44931506849315067,2.1917808219178082E-2,2.3906095647626242]
["2015-05-29",728557,1.89,0.44931506849315067,2.1917808219178082E-2,1.620463464080367,717668.5,2.44,0.44931506849315067,2.1917808219178082E-2,2.0282358973787322]
{"$rows_left_out":1224}
{"sheet":"Constants","index":3,"n_rows":36,"n_cols":7,"rows_kept":36,"cut":false,"hidden":false,"merged":[]}
[null,"Constants:"]
[]
[null,"Constant","Value","Comment"]
[null,null,null,null,null,null,{"$f":"IF(B4=\"\",\"\",B4&\" = Range(\"&B4&\")\")","v":""}]
[null,"internal_BSUoS_cost_per_year",164,"£, millions"]
[null,"forecast_BSIS_profit_per_year",8,"£, millions"]
[null,"black_start_contract_costs_per_day",0.123,"£, millions"]
[null,"days_per_year",365]
[null,"hours_per_SP",0.5]
[]
[null,"DA_report_dir","S:\\OandT\\OptRisk\\Balancing Services\\Commercial Strategy - Prompt\\Commercial Strategy Report (Day Ahead)\\"]
[]
[null,"forecast_values_wkst","F-Values","Name of worksheet"]
[null,"forecast_values_date_col",1,"Date is in column XX"]
[null,"forecast_values_totals_col",30,"\"Overall\" cost for each day is in column XX"]
[]
[null,"outturn_values_wkst","O-Values","Name of worksheet"]
[null,"outturn_values_date_col",1,"Date is in column XX"]
[null,"outturn_values_totals_col",30,"\"Overall\" cost for each day is in column XX"]
[]
[null,"inputs_wkst","Inputs","Name of worksheet"]
[]
[null,"report_wkst","Report","Name of worksheet"]
[]
[null,"data_wkst","Data","Name of worksheet"]
[null,"data_date_col",1]
[null,"data_forecast_demand_col",2]
[null,"data_forecast_ext_col",3]
[null,"data_forecast_int_col",4]
[null,"data_forecast_BSIS_col",5]
[null,"data_forecast_BSUoS_col",6]
[null,"data_outturn_demand_col",7]
[null,"data_outturn_ext_col",8]
[null,"data_outturn_int_col",9]
[null,"data_outturn_BSIS_col",10]
[null,"data_outturn_BSUoS_col",11]

{"sheet":"Version Control","index":4,"n_rows":5,"n_cols":6,"rows_kept":5,"cut":false,"hidden":false,"merged":[]}
[null,"Version Control:"]
[]
[null,"Version","Date Implemented ","Change","Implementor","Trading Database Change & Failure Risk Register Updated "]
[null,1,"2015-05-12","Created","Robert Westmancoat","Yes"]
[null,2.1,"2017-08-23","BSUoS Internal and BSIS updated on the \"Constants\" sheet to current data, black start costs included ","Zoe Carlin","No"]